Benzenamine, 2,4,6-tris(1,1-dimethylethyl)-
- Formula: C18H31N
- Molecular weight: 261.4454
- IUPAC Standard InChIKey: REJGDSCBQPJPQT-UHFFFAOYSA-N
- CAS Registry Number: 961-38-6
- Chemical structure:

Phase change data

Data compiled by: William E. Acree, Jr., James S. Chickos
Quantity | Value | Units | Method | Reference | Comment |
---|---|---|---|---|---|
ΔsubH° | 92.5 ± 1.1 | kJ/mol | GS | Verevkin, 2000 |
Enthalpy of fusion
ΔfusH (kJ/mol) | Temperature (K) | Reference |
---|---|---|
19.38 | 426.4 | Verevkin, 2000 |

Gas phase ion energetics data

Data compiled as indicated in comments:
LBLHLM - Sharon G. Lias, John E. Bartmess, Joel F. Liebman, John L. Holmes, Rhoda D. Levin, and W. Gary Mallard
Ionization energy determinations
IE (eV) | Method | Reference | Comment |
---|---|---|---|
6.9 | PE | Cetinkaya, Lappert, et al., 1983 | LBLHLM |
7.30 | PE | Cetinkaya, Lappert, et al., 1983 | Vertical value; LBLHLM |

References

Verevkin, 2000
Verevkin, Sergey P.,
Thermochemical study of the ortho interactions in alkyl substituted anilines,
The Journal of Chemical Thermodynamics, 2000, 32, 2, 247-259, https://doi.org/10.1006/jcht.1999.0587
. [all data]
Cetinkaya, Lappert, et al., 1983
Cetinkaya, B.; Lappert, M.F.; Suffolk, R.J.,
Photoelectron spectra of some sterically hindered phenols and related compounds,
J. Chem. Res. Synop., 1983, 316. [all data]