Phenol, 3,4-dimethyl-
- Formula: C8H10O
- Molecular weight: 122.1644
- IUPAC Standard InChIKey: YCOXTKKNXUZSKD-UHFFFAOYSA-N
- CAS Registry Number: 95-65-8
- Chemical structure:

Phase change data

Data compiled as indicated in comments:
BS - Robert L. Brown and Stephen E. Stein
TRC - Thermodynamics Research Center, NIST Boulder Laboratories, Chris Muzny director
AC - William E. Acree, Jr., James S. Chickos
ALS - Hussein Y. Afeefy, Joel F. Liebman, and Stephen E. Stein
DRB - Donald R. Burgess, Jr.
DH - Eugene S. Domalski and Elizabeth D. Hearing
Quantity | Value | Units | Method | Reference | Comment |
---|---|---|---|---|---|
Tboil | 500. ± 2. | K | AVG | N/A | Average of 9 values; Individual data points |
Quantity | Value | Units | Method | Reference | Comment |
Tfus | 337. ± 3. | K | AVG | N/A | Average of 15 values; Individual data points |
Quantity | Value | Units | Method | Reference | Comment |
Tc | 729.85 | K | N/A | Ambrose, 1963 | Uncertainty assigned by TRC = 0.8 K; TRC |
Tc | 769.55 | K | N/A | Glaser and Ruland, 1957 | Uncertainty assigned by TRC = 2. K; TRC |
Quantity | Value | Units | Method | Reference | Comment |
Pc | 65.8612 | bar | N/A | Glaser and Ruland, 1957 | Uncertainty assigned by TRC = 3.0398 bar; TRC |
Quantity | Value | Units | Method | Reference | Comment |
ΔvapH° | 85.03 | kJ/mol | N/A | Majer and Svoboda, 1985 | |
ΔvapH° | 85.1 | kJ/mol | N/A | Morawetz, 1971 | AC |
ΔvapH° | 85.0 | kJ/mol | N/A | Morawetz, Elvebredd, et al., 1968 | AC |
ΔvapH° | 45.61 | kJ/mol | C | Glaser and Ruland, 1957 | ALS |
Quantity | Value | Units | Method | Reference | Comment |
ΔsubH° | 85.1 | kJ/mol | N/A | Morawetz, 1971 | AC |
ΔsubH° | 85.0 | kJ/mol | N/A | Morawetz, Elvebredd, et al., 1968 | Author of Morawetz, Elvebredd, et al., 1968 refers to the determined value as the enthalpy of vaporization even though the compound is a solid; AC |
ΔsubH° | 85.7 ± 0.1 | kJ/mol | V | Andon, Biddiscombe, et al., 1960 | ALS |
ΔsubH° | 85.8 | kJ/mol | N/A | Andon, Biddiscombe, et al., 1960 | DRB |
Enthalpy of vaporization
ΔvapH (kJ/mol) | Temperature (K) | Method | Reference | Comment |
---|---|---|---|---|
54.9 | 459. | A,GS,EB | Stephenson and Malanowski, 1987 | Based on data from 444. to 502. K. See also Andon, Biddiscombe, et al., 1960, 2.; AC |
Antoine Equation Parameters
log10(P) = A − (B / (T + C))
P = vapor pressure (bar)
T = temperature (K)
View plot Requires a JavaScript / HTML 5 canvas capable browser.
Temperature (K) | A | B | C | Reference | Comment |
---|---|---|---|---|---|
445.08 to 502.1 | 4.17211 | 1598.887 | -116.356 | Andon, Biddiscombe, et al., 1960 | Coefficents calculated by NIST from author's data. |
Enthalpy of sublimation
ΔsubH (kJ/mol) | Temperature (K) | Method | Reference | Comment |
---|---|---|---|---|
85.7 ± 0.1 | 282. to 323. | GS | Andon, Biddiscombe, et al., 1960, 2 | See also Cox and Pilcher, 1970 and Stephenson and Malanowski, 1987.; AC |
72.4 ± 0.8 | 299. | V | Wolf and Weghofer, 1938 | ALS |
Enthalpy of fusion
ΔfusH (kJ/mol) | Temperature (K) | Method | Reference | Comment |
---|---|---|---|---|
18.127 | 334.0 | N/A | Poeti, Fanelli, et al., 1982 | DH |
19.04 | 338.5 | DSC | Jamróz, Palczewska-Tulinska, et al., 1998 | AC |
18.13 | 334. | N/A | Acree, 1991 | AC |
Entropy of fusion
ΔfusS (J/mol*K) | Temperature (K) | Reference | Comment |
---|---|---|---|
54.27 | 334.0 | Poeti, Fanelli, et al., 1982 | DH |

Gas phase ion energetics data

Data compiled by: Sharon G. Lias, John E. Bartmess, Joel F. Liebman, John L. Holmes, Rhoda D. Levin, and W. Gary Mallard
Ionization energy determinations
IE (eV) | Method | Reference |
---|---|---|
8.09 | EI | Russell, Freiser, et al., 1983 |
Appearance energy determinations
Ion | AE (eV) | Other Products | Method | Reference | Comment |
---|---|---|---|---|---|
C6H7+ | 10.93 | ? | EI | Russell, Freiser, et al., 1983 | |
C7H7O+ | 10.87 | CH3 | EI | Russell, Freiser, et al., 1983 |

Gas phase thermochemistry data

Data compiled as indicated in comments:
ALS - Hussein Y. Afeefy, Joel F. Liebman, and Stephen E. Stein
GT - Glushko Thermocenter, Russian Academy of Sciences, Moscow
Quantity | Value | Units | Method | Reference | Comment |
---|---|---|---|---|---|
ΔfH°gas | -156.6 ± 0.59 | kJ/mol | Ccb | Andon, Biddiscombe, et al., 1960 | ALS |
Constant pressure heat capacity of gas
Cp,gas (J/mol*K) | Temperature (K) | Reference | Comment |
---|---|---|---|
39.43 | 50. | Kudchadker S.A., 1979 | GT |
66.56 | 100. | ||
93.95 | 150. | ||
118.57 | 200. | ||
152.35 | 273.15 | ||
163.52 | 298.15 | ||
164.33 | 300. | ||
205.88 | 400. | ||
240.97 | 500. | ||
269.69 | 600. | ||
293.30 | 700. | ||
312.99 | 800. | ||
329.64 | 900. | ||
343.84 | 1000. | ||
356.00 | 1100. | ||
366.48 | 1200. | ||
375.52 | 1300. | ||
383.35 | 1400. | ||
390.15 | 1500. |

Condensed phase thermochemistry data

Data compiled by: Hussein Y. Afeefy, Joel F. Liebman, and Stephen E. Stein
Quantity | Value | Units | Method | Reference | Comment |
---|---|---|---|---|---|
ΔfH°solid | -242.4 ± 0.59 | kJ/mol | Ccb | Andon, Biddiscombe, et al., 1960 | |
Quantity | Value | Units | Method | Reference | Comment |
ΔcH°solid | -4334.9 ± 1.1 | kJ/mol | Ccb | Andon, Biddiscombe, et al., 1960 | Corresponding ΔfHºsolid = -242.3 kJ/mol (simple calculation by NIST; no Washburn corrections) |

Kovats' RI, non-polar column, isothermal

View large format table.

Column type Active phase Temperature (C) I Reference Comment
CapillarySE-30100.1165.Berezkin, Popova, et al., 199730. m/0.25 mm/0.5 μm, He
CapillaryOV-1150.1151.Zhang, Chen, et al., 199725. m/0.2 mm/0.33 μm, N2
CapillaryHP-1100.1168.Zhang, Li, et al., 1992N2; Column length: 25. m; Column diameter: 0.20 mm
CapillaryHP-1100.1169.Zhang, Li, et al., 1992N2; Column length: 25. m; Column diameter: 0.20 mm
CapillaryPS-255150.1172.Engewald, Billing, et al., 198850. m/0.30 mm/0.25 μm
PackedSE-30220.1209.Sellier, Tersac, et al., 1981Column length: 2. m

Kovats' RI, polar column, isothermal

View large format table.

Column type Active phase Temperature (C) I Reference Comment
PackedCarbowax 20M220.2233.Sellier, Tersac, et al., 1981Column length: 2. m

Van Den Dool and Kratz RI, non-polar column, temperature ramp

View large format table.

Column type Active phase I Reference Comment
CapillaryOV-11166.5Gautzsch and Zinn, 19968. K/min; Tstart: 35. C; Tend: 300. C
CapillaryDB-51193.Rostad and Pereira, 198630. m/0.26 mm/0.25 μm, He, 50. C @ 4. min, 6. K/min, 300. C @ 20. min

Van Den Dool and Kratz RI, non-polar column, custom temperature program

View large format table.

Column type Active phase I Reference Comment
CapillaryVF-5MS1195.4Mjøs, Meier, et al., 200650. m/0.25 mm/0.25 μm, He; Program: 60C(2min) => 30C/min => 100C => 1C/min =>
CapillaryVF-5MS1196.3Mjøs, Meier, et al., 200650. m/0.25 mm/0.25 μm, He; Program: 60C(2min) => 30C/min => 100C => 2C/min =>
CapillaryVF-5MS1198.2Mjøs, Meier, et al., 200650. m/0.25 mm/0.25 μm, He; Program: 60C(2min) => 30C/min => 100C => 4C/min =>
CapillaryDB-5MS1182.Varlet V., Knockaert C., et al., 200630. m/0.32 mm/0.5 μm, He; Program: 70C(1min) => 3C/min => 80C(1min) => 5C/min => 150C => 10C/min => 280C (4min)

Van Den Dool and Kratz RI, polar column, temperature ramp

View large format table.

Column type Active phase I Reference Comment
CapillarySupelcowax-102225.Chung, Yung, et al., 200160. m/0.25 mm/0.25 μm, He, 35. C @ 5. min, 2. K/min, 195. C @ 90. min

Normal alkane RI, non-polar column, temperature ramp

View large format table.

Column type Active phase I Reference Comment
CapillaryTR-11169.Gruzdev, Kuzivanov, et al., 201230. m/0.32 mm/0.25 μm, Helium, 5. K/min; Tstart: 50. C; Tend: 300. C
CapillaryDB-51221.Czerny, Brueckner, et al., 201130. m/0.32 mm/0.25 μm, Helium, 40. C @ 2. min, 8. K/min, 250. C @ 5. min
CapillaryDB-51190.Fadel, Mageed, et al., 2006He, 60. C @ 5. min, 4. K/min; Column length: 60. m; Column diameter: 0.32 mm; Tend: 250. C
CapillaryBP-11171.Health Safety Executive, 200050. m/0.22 mm/0.75 μm, He, 5. K/min; Tstart: 50. C; Tend: 200. C
CapillaryUltra-11163.Okumura, 199125. m/0.32 mm/0.25 μm, He, 3. K/min; Tstart: 80. C; Tend: 260. C

Normal alkane RI, non-polar column, custom temperature program

View large format table.

Column type Active phase I Reference Comment
CapillarySLB-5 MS1191.Mondello, 201230. m/0.25 mm/0.25 μm, Helium; Program: not specified
CapillarySLB-5 MS1197.Mondello, 201230. m/0.25 mm/0.25 μm, Helium; Program: not specified
CapillaryZB-51193.de Simon, Estruelas, et al., 200930. m/0.25 mm/0.25 μm, Helium; Program: 45 0C 3 0C/min -> 230 0C (10 min) 10 0C/min -> 270 0C (21 min)
CapillaryOV-1, SE-30, Methyl silicone, SP-2100, OV-101, DB-1, etc.1167.Waggott and Davies, 1984Hydrogen; Column length: 50. m; Column diameter: 0.32 mm; Program: not specified
CapillaryOV-11167.Waggott and Davies, 1984Hydrogen; Column length: 50. m; Column diameter: 0.32 mm; Program: not specified

Normal alkane RI, polar column, temperature ramp

View large format table.

Column type Active phase I Reference Comment
CapillaryDB-FFAP2208.Czerny, Brueckner, et al., 201130. m/0.32 mm/0.25 μm, Helium, 40. C @ 2. min, 8. K/min, 230. C @ 5. min

Normal alkane RI, polar column, custom temperature program

View large format table.

Column type Active phase I Reference Comment
CapillarySupelcowax-102192.de Simon, Estruelas, et al., 200930. m/0.25 mm/0.25 μm, Helium; Program: 45 0C 3 0C/min -> 230 0C (10 min) 10 0C/min -> 270 0C (21 min)
CapillaryDB-Wax2189.Peng, Yang, et al., 1991Program: not specified

Lee's RI, non-polar column, temperature ramp

View large format table.

Column type Active phase I Reference Comment
CapillaryDB-5201.40Williams and Horne, 1995He, 60. C @ 2. min, 5. K/min; Column length: 25. m; Column diameter: 0.3 mm; Tend: 270. C
CapillaryDB-5199.6Donnelly, Abdel-Hamid, et al., 199330. m/0.32 mm/0.25 μm, He, 40. C @ 3. min, 8. K/min, 285. C @ 29.5 min
CapillaryDB-5201.49Rostad and Pereira, 198630. m/0.26 mm/0.25 μm, He, 50. C @ 4. min, 6. K/min, 300. C @ 20. min

Lee's RI, non-polar column, custom temperature program

View large format table.

Column type Active phase I Reference Comment
CapillaryMethyl Silicone201.49Eckel, Ross, et al., 1993Program: not specified
CapillaryMethyl Silicone201.68Eckel, Ross, et al., 1993Program: not specified

References

Ambrose, 1963
Ambrose, D.,
Critical Temperatures of Some Phenols and Other Organic Compounds,
Trans. Faraday Soc., 1963, 59, 1988. [all data]
Glaser and Ruland, 1957
Glaser, F.; Ruland, H.,
Untersuchungsen über dampfdruckkurven und kritische daten einiger technisch wichtiger organischer substanzen,
Chem. Ing. Techn., 1957, 29, 772. [all data]
Majer and Svoboda, 1985
Majer, V.; Svoboda, V.,
Enthalpies of Vaporization of Organic Compounds: A Critical Review and Data Compilation, Blackwell Scientific Publications, Oxford, 1985, 300. [all data]
Morawetz, 1971
Morawetz, E.,
Chem. Scr., 1971, 1, 103. [all data]
Morawetz, Elvebredd, et al., 1968
Morawetz, Ernst; Elvebredd, I.; Brunvoll, J.; Hagen, G.; Paasivirta, Jaakko,
A Non-Equilibrium Low Vapor Pressure Heat of Vaporization Calorimeter. Part I. Vapor Pressure Range 200-10^-3 mm Hg.,
Acta Chem. Scand., 1968, 22, 1509-1531, https://doi.org/10.3891/acta.chem.scand.22-1509
. [all data]
Andon, Biddiscombe, et al., 1960
Andon, R.J.L.; Biddiscombe, D.P.; Cox, J.D.; Handley, R.; Harrop, D.; Herington, E.F.G.; Martin, J.F.,
Thermodynamic properties of organic oxygen compounds. Part I. Preparation and physical properties of pure phenol, cresols, and xylenols,
J. Chem. Soc., 1960, 5246-5254. [all data]
Stephenson and Malanowski, 1987
Stephenson, Richard M.; Malanowski, Stanislaw,
Handbook of the Thermodynamics of Organic Compounds, 1987, https://doi.org/10.1007/978-94-009-3173-2
. [all data]
Andon, Biddiscombe, et al., 1960, 2
Andon, R.J.L.; Biddiscombe, D.P.; Cox, J.D.; Handley, R.; Harrop, D.; Herington, E.F.G.; Martin, J.F.,
1009. Thermodynamic properties of organic oxygen compounds. Part I. Preparation and physical properties of pure phenol, cresols, and xylenols,
J. Chem. Soc., 1960, 5246, https://doi.org/10.1039/jr9600005246
. [all data]
Cox and Pilcher, 1970
Cox, J.D.; Pilcher, G.,
Thermochemistry of Organic and Organometallic Compounds, Academic Press Inc., London, 1970, 643. [all data]
Wolf and Weghofer, 1938
Wolf, K.L.; Weghofer, H.,
Uber sublimationswarmen,
Z. Phys. Chem., 1938, 39, 194-208. [all data]
Poeti, Fanelli, et al., 1982
Poeti, G.; Fanelli, E.; Braghetti, M.,
A differential scanning calorimetric study of some phenol derivatives,
J. Therm. Anal., 1982, 24(2), 273-279. [all data]
Jamróz, Palczewska-Tulinska, et al., 1998
Jamróz, Malgorzata E.; Palczewska-Tulinska, Marcela; Wyrzykowska-Stankiewicz, Danuta; Szafranski, Andrzej M.; Polaczek, Jerzy; Dobrowolski, Jan Cz.; Jamróz, Michal H.; Mazurek, Aleksander P.,
The urea--phenol(s) systems,
Fluid Phase Equilibria, 1998, 152, 2, 307-326, https://doi.org/10.1016/S0378-3812(98)90206-0
. [all data]
Acree, 1991
Acree, William E.,
Thermodynamic properties of organic compounds: enthalpy of fusion and melting point temperature compilation,
Thermochimica Acta, 1991, 189, 1, 37-56, https://doi.org/10.1016/0040-6031(91)87098-H
. [all data]
Russell, Freiser, et al., 1983
Russell, D.H.; Freiser, B.S.; McBay, E.H.; Canada, D.C.,
The structure of decomposing [C7H7O]+ ions: Benzyl versus tropylium ion structures,
Org. Mass Spectrom., 1983, 18, 474. [all data]