o-Toluidine
- Formula: C7H9N
- Molecular weight: 107.1531
- IUPAC Standard InChIKey: RNVCVTLRINQCPJ-UHFFFAOYSA-N
- CAS Registry Number: 95-53-4
- Chemical structure:
View 3d structure (requires JavaScript / HTML 5) - Other names: Benzenamine, 2-methyl-; o-Aminotoluene; o-Methylaniline; o-Methylbenzenamine; o-Tolylamine; 1-Amino-2-methylbenzene; 2-Aminotoluene; 2-Methyl-1-aminobenzene; 2-Methylaniline; 2-Methylbenzenamine; 2-Toluidine; 2-Amino-1-methylbenzene; 1-Methyl-2-aminobenzene; o-Toluide; o-Toluidin; o-Toluidyna; Aniline, 2-methyl-; C.I. 37077; Rcra waste number U328; NSC 15348

Gas phase ion energetics data

Data evaluated as indicated in comments:
HL - Edward P. Hunter and Sharon G. Lias
L - Sharon G. Lias
Data compiled as indicated in comments:
LL - Sharon G. Lias and Joel F. Liebman
LLK - Sharon G. Lias, Rhoda D. Levin, and Sherif A. Kafafi
RDSH - Henry M. Rosenstock, Keith Draxl, Bruce W. Steiner, and John T. Herron
Quantity | Value | Units | Method | Reference | Comment |
---|---|---|---|---|---|
IE (evaluated) | 7.47 ± 0.04 | eV | N/A | N/A | L |
Quantity | Value | Units | Method | Reference | Comment |
Proton affinity (review) | 890.9 | kJ/mol | N/A | Hunter and Lias, 1998 | HL |
Quantity | Value | Units | Method | Reference | Comment |
Gas basicity | 859.1 | kJ/mol | N/A | Hunter and Lias, 1998 | HL |
Ionization energy determinations
IE (eV) | Method | Reference | Comment |
---|---|---|---|
7.58 | EI | Selim, Rabbih, et al., 1992 | LL |
7.45 ± 0.02 | PE | Maier and Turner, 1973 | LLK |
7.52 | PE | Cowling and Johnstone, 1973 | LLK |
7.44 ± 0.02 | PI | Potapov and Iskakov, 1971 | LLK |
7.6 ± 0.1 | CTS | Farrell and Newton, 1966 | RDSH |
7.7 ± 0.1 | EI | Eland, Shepherd, et al., 1966 | RDSH |
7.69 | CTS | Kinoshita, 1962 | RDSH |
7.75 | CTS | Briegleb and Czekalla, 1959 | RDSH |
7.84 | PE | Palmer, Moyes, et al., 1979 | Vertical value; LLK |
7.83 | PE | Kobayashi and Nagakura, 1974 | Vertical value; LLK |
7.83 | PE | Kobayashi and Nagakura, 1972 | Vertical value; LLK |
Appearance energy determinations
Ion | AE (eV) | Other Products | Method | Reference | Comment |
---|---|---|---|---|---|
C6H6+ | 10.53 ± 0.07 | ? | EI | Selim, Rabbih, et al., 1992 | LL |
C7H8N+ | 11.25 ± 0.05 | H | PI | Potapov and Iskakov, 1971 | LLK |

Reaction thermochemistry data

Data compiled by: Hussein Y. Afeefy, Joel F. Liebman, and Stephen E. Stein
Individual Reactions
By formula: C7H5NO + C7H9N = C14H14N2O
Quantity | Value | Units | Method | Reference | Comment |
---|---|---|---|---|---|
ΔrH° | -93.0 | kJ/mol | Cm | Pannone and Macosko, 1987 | liquid phase |

Gas phase thermochemistry data

Data compiled as indicated in comments:
ALS - Hussein Y. Afeefy, Joel F. Liebman, and Stephen E. Stein
DRB - Donald R. Burgess, Jr.
Quantity | Value | Units | Method | Reference | Comment |
---|---|---|---|---|---|
ΔfH°gas | 12.7 ± 0.1 | kcal/mol | Ccr | Steele, Chirico, et al., 1994 | see Steele, Chirico, et al., 1990; ALS |
ΔfH°gas | 13.1 | kcal/mol | Ccb | Draeger, 1984 | ALS |
ΔfH°gas | 12.3 | kcal/mol | N/A | Pushin, 1954 | Value computed using ΔfHliquid° value of -6.5 kj/mol from Pushin, 1954 and ΔvapH° value of 57.9 kj/mol from Steele, Chirico, et al., 1994.; DRB |

Condensed phase thermochemistry data

Data compiled as indicated in comments:
ALS - Hussein Y. Afeefy, Joel F. Liebman, and Stephen E. Stein
DH - Eugene S. Domalski and Elizabeth D. Hearing
Quantity | Value | Units | Method | Reference | Comment |
---|---|---|---|---|---|
ΔfH°liquid | -1.13 ± 0.23 | kcal/mol | Ccr | Steele, Chirico, et al., 1994 | see Steele, Chirico, et al., 1990; ALS |
ΔfH°liquid | -1.55 | kcal/mol | Ccb | Pushin, 1954 | Author's hf298_condensed=-4.0 kcal/mol; ALS |
Quantity | Value | Units | Method | Reference | Comment |
ΔcH°liquid | -964.65 ± 0.21 | kcal/mol | Ccr | Steele, Chirico, et al., 1994 | see Steele, Chirico, et al., 1990; ALS |
ΔcH°liquid | -964.2 | kcal/mol | Ccb | Pushin, 1954 | Author's hf298_condensed=-4.0 kcal/mol; ALS |
ΔcH°liquid | -971.31 | kcal/mol | Ccb | Swarts, 1909 | ALS |
Constant pressure heat capacity of liquid
Cp,liquid (cal/mol*K) | Temperature (K) | Reference | Comment |
---|---|---|---|
39.29 | 303.15 | Guseinov, Mirzaliev, et al., 1988 | T = 303 to 463 K. p= 0.1 MPa. Unsmoothed experimental datum. Cp(liq) = 0.8056 + 0.0023634T + (0.0017364 - 8.1591x10-6T)P kJ/kg*K (303.15 to 523.15 K, 0.1 to 25 MPa).; DH |
50.10 | 302.5 | de Kolossowsky and Udowenko, 1934 | DH |
50.10 | 302.5 | Kolosovskii and Udovenko, 1934 | DH |
48.21 | 288. | Radulescu and Jula, 1934 | DH |
50.50 | 298. | von Reis, 1881 | T = 294 to 485 K.; DH |

Phase change data

Data compiled as indicated in comments:
BS - Robert L. Brown and Stephen E. Stein
TRC - Thermodynamics Research Center, NIST Boulder Laboratories, Chris Muzny director
AC - William E. Acree, Jr., James S. Chickos
ALS - Hussein Y. Afeefy, Joel F. Liebman, and Stephen E. Stein
DRB - Donald R. Burgess, Jr.
DH - Eugene S. Domalski and Elizabeth D. Hearing
Quantity | Value | Units | Method | Reference | Comment |
---|---|---|---|---|---|
Tboil | 473. ± 2. | K | AVG | N/A | Average of 16 values; Individual data points |
Quantity | Value | Units | Method | Reference | Comment |
Tfus | 252. ± 8. | K | AVG | N/A | Average of 10 values; Individual data points |
Quantity | Value | Units | Method | Reference | Comment |
Ttriple | 258.730 | K | N/A | Steele, Chirico, et al., 1994, 2 | Uncertainty assigned by TRC = 0.005 K; TRC |
Quantity | Value | Units | Method | Reference | Comment |
Tc | 694.15 | K | N/A | Glaser and Ruland, 1957 | Uncertainty assigned by TRC = 2. K; TRC |
Quantity | Value | Units | Method | Reference | Comment |
Pc | 37.0000 | atm | N/A | Glaser and Ruland, 1957 | Uncertainty assigned by TRC = 2.5000 atm; TRC |
Quantity | Value | Units | Method | Reference | Comment |
ΔvapH° | 14. ± 3. | kcal/mol | AVG | N/A | Average of 7 values; Individual data points |
Enthalpy of vaporization
ΔvapH (kcal/mol) | Temperature (K) | Method | Reference | Comment |
---|---|---|---|---|
13.8 | 300. | EB,IP | Steele, Chirico, et al., 1994 | Based on data from 290. to 517. K.; AC |
13.0 | 340. | EB,IP | Steele, Chirico, et al., 1994 | Based on data from 290. to 517. K.; AC |
12.3 | 380. | EB,IP | Steele, Chirico, et al., 1994 | Based on data from 290. to 517. K.; AC |
11.6 | 420. | EB,IP | Steele, Chirico, et al., 1994 | Based on data from 290. to 517. K.; AC |
10.9 | 460. | EB,IP | Steele, Chirico, et al., 1994 | Based on data from 290. to 517. K.; AC |
10.2 | 500. | EB.IP | Steele, Chirico, et al., 1994 | Based on data from 290. to 517. K.; AC |
12.0 | 406. | A | Stephenson and Malanowski, 1987 | Based on data from 391. to 474. K. See also Dreisbach and Shrader, 1949 and Boublik, Fried, et al., 1984.; AC |
Antoine Equation Parameters
log10(P) = A − (B / (T + C))
P = vapor pressure (atm)
T = temperature (K)
View plot Requires a JavaScript / HTML 5 canvas capable browser.
Temperature (K) | A | B | C | Reference | Comment |
---|---|---|---|---|---|
391.61 to 473.5 | 4.18597 | 1617.232 | -87.126 | Dreisbach and Shrader, 1949 | Coefficents calculated by NIST from author's data. |
Enthalpy of fusion
ΔfusH (kcal/mol) | Temperature (K) | Reference | Comment |
---|---|---|---|
1.936 | 249.55 | Meva'a and Lichanot, 1990 | DH |
2.787 | 287.6 | Steele, Chirico, et al., 1994 | AC |
Entropy of fusion
ΔfusS (cal/mol*K) | Temperature (K) | Reference | Comment |
---|---|---|---|
7.6 | 249.55 | Meva'a and Lichanot, 1990 | DH |

Van Den Dool and Kratz RI, non-polar column, temperature ramp

Data compiled by: NIST Mass Spectrometry Data Center, William E. Wallace, director

Column type CapillaryCapillaryPackedCapillary
Active phase DB-1OV-1SE-30DB-5
Column length (m) 30. 3.0530.
Carrier gas He HeHe
Substrate   Supelcoport and Chromosorb
Column diameter (mm) 0.25  0.26
Phase thickness (μm) 0.25  0.25
Tstart (C) 40.35.40.50.
Tend (C) 325.300.250.300.
Heat rate (K/min) 3.8.10.6.
Initial hold (min)   4.4.
Final hold (min)   60.20.
I 1032.71040.51068.1072.
ReferenceSun and Stremple, 2003Gautzsch and Zinn, 1996Peng, Ding, et al., 1988Rostad and Pereira, 1986
Comment MSDC-RI MSDC-RI MSDC-RI MSDC-RI

Normal alkane RI, polar column, custom temperature program

Data compiled by: NIST Mass Spectrometry Data Center, William E. Wallace, director

Column type CapillaryCapillary
Active phase DB-WaxDB-Wax
Column length (m)
Carrier gas
Substrate
Column diameter (mm)
Phase thickness (μm)
Program not specifiednot specified
I 1789.1800.
ReferencePeng, Yang, et al., 1991Peng, Yang, et al., 1991
Comment MSDC-RI MSDC-RI

Kovats' RI, polar column, isothermal

Data compiled by: NIST Mass Spectrometry Data Center, William E. Wallace, director

Column type PackedPackedPackedPacked
Active phase PEG-2000PEG-2000PEG-2000PEG-2000
Column length (m) 3.3.3.3.
Carrier gas HeHeHeHe
Substrate Celite 545 (44-60 mesh)Celite 545 (44-60 mesh)Celite 545 (44-60 mesh)Celite 545 (44-60 mesh)
Column diameter (mm)
Phase thickness (μm)
Temperature (C) 179.180.200.200.
I 1796.1807.1808.1814.
ReferenceAnderson, Jurel, et al., 1973Anderson, Jurel, et al., 1973Anderson, Jurel, et al., 1973Anderson, Jurel, et al., 1973
Comment MSDC-RI MSDC-RI MSDC-RI MSDC-RI

References

Hunter and Lias, 1998
Hunter, E.P.; Lias, S.G.,
Evaluated Gas Phase Basicities and Proton Affinities of Molecules: An Update,
J. Phys. Chem. Ref. Data, 1998, 27, 3, 413-656, https://doi.org/10.1063/1.556018
. [all data]
Selim, Rabbih, et al., 1992
Selim, E.T.M.; Rabbih, M.A.; Fahmey, M.A.; Hawash, M.F.,
Electron impact study of [C6H6]+ fragment ions produced from isomeric C7H9N precursors using the deconvoluted first differential technique and kinetic release measurements,
Int. J. Mass Spectrom. Ion Processes, 1992, 113, 133. [all data]
Maier and Turner, 1973
Maier, J.P.; Turner, D.W.,
Steric inhibition of resonance studied by molecular photoelectron spectroscopy Part 3. Anilines, Phenols and Related Compounds,
J. Chem. Soc. Faraday Trans. 2, 1973, 69, 521. [all data]
Cowling and Johnstone, 1973
Cowling, S.A.; Johnstone, R.A.W.,
Photoelectron spectroscopy: The effects of steric inhibition to resonance in anilines,
J. Electron Spectrosc. Relat. Phenom., 1973, 2, 161. [all data]
Potapov and Iskakov, 1971
Potapov, V.K.; Iskakov, L.I.,
Electronic structure and photoionization of aromatic amines,
High Energy Chem., 1971, 5, 237, In original 264. [all data]
Farrell and Newton, 1966
Farrell, P.G.; Newton, J.,
Ionization potentials of primary aromatic amines and aza-hydrocarbons,
Tetrahedron Lett., 1966, 5517. [all data]
Eland, Shepherd, et al., 1966
Eland, J.H.D.; Shepherd, P.J.; Danby, C.J.,
Ionization potentials of aromatic molecules determined by analytical interpretation of electron impact data,
Z. Naturforsch., 1966, 21a, 1580. [all data]
Kinoshita, 1962
Kinoshita, M.,
The absorption spectra of the molecular complexes of aromatic compounds with p-bromanil,
Bull. Chem. Soc. Japan, 1962, 35, 1609. [all data]
Briegleb and Czekalla, 1959
Briegleb, G.; Czekalla, J.,
Die Bestimmung von lonisierungsenergien aus den Spektren von Elektronenubergangskomplexen,
Z.Elektrochem., 1959, 63, 6. [all data]
Palmer, Moyes, et al., 1979
Palmer, M.H.; Moyes, W.; Spiers, M.; Ridyard, J.N.A.,
The electronic structure of substituted benzenes; a study of aniline, the toluidines, phenylenediamines and fluoroanilines by photoelectron spectroscopy and ab initio calculations,
J. Mol. Struct., 1979, 53, 235. [all data]
Kobayashi and Nagakura, 1974
Kobayashi, T.; Nagakura, S.,
Photoelectron spectra of substituted benzenes,
Bull. Chem. Soc. Jpn., 1974, 47, 2563. [all data]
Kobayashi and Nagakura, 1972
Kobayashi, T.; Nagakura, S.,
Photoelectron spectra of anilines,
Chem. Lett., 1972, 1013. [all data]