Phenol, 2-methyl-
- Formula: C7H8O
- Molecular weight: 108.1378
- IUPAC Standard InChIKey: QWVGKYWNOKOFNN-UHFFFAOYSA-N
- CAS Registry Number: 95-48-7
- Chemical structure:
View 3d structure (requires JavaScript / HTML 5) - Other names: o-Cresol; o-Hydroxytoluene; o-Methylphenol; o-Methylphenylol; o-Oxytoluene; 1-Hydroxy-2-methylbenzene; 2-Cresol; 2-Hydroxytoluene; 2-Methylphenol; Orthocresol; o-Kresol; Rcra waste number U052; o-Cresylic acid; 1-Methyl-2-hydroxybenzene; NSC 23076; o-Toluol

Gas phase thermochemistry data

Data compiled as indicated in comments:
ALS - Hussein Y. Afeefy, Joel F. Liebman, and Stephen E. Stein
GT - Glushko Thermocenter, Russian Academy of Sciences, Moscow
Quantity | Value | Units | Method | Reference | Comment |
---|---|---|---|---|---|
ΔfH°gas | -128.3 ± 0.88 | kJ/mol | Ccb | Cox, 1961 | ALS |
ΔfH°gas | -128.6 ± 0.92 | kJ/mol | Ccb | Andon, Biddiscombe, et al., 1960 | ALS |
Constant pressure heat capacity of gas
Cp,gas (J/mol*K) | Temperature (K) | Reference | Comment |
---|---|---|---|
38.22 | 50. | Kudchadker S.A., 1978 | Selected entropy values at 298.15 and 400 K are lower than the experimental ones by 2.2 and 2.1 J/mol*K, respectively. The discrepancy is close to the experimental uncertainty. The same entropy values calculated by [ Green J.H.S., 1962] are greater than the observed by 2.8 and 3.9 J/mol*K.; GT |
59.18 | 100. | ||
75.09 | 150. | ||
91.26 | 200. | ||
117.84 | 273.15 | ||
127.30 | 298.15 | ||
128.00 | 300. | ||
164.31 | 400. | ||
195.29 | 500. | ||
220.43 | 600. | ||
240.85 | 700. | ||
257.68 | 800. | ||
271.77 | 900. | ||
283.70 | 1000. | ||
293.87 | 1100. | ||
302.60 | 1200. | ||
310.11 | 1300. | ||
316.61 | 1400. | ||
322.25 | 1500. |

Condensed phase thermochemistry data

Data compiled as indicated in comments:
ALS - Hussein Y. Afeefy, Joel F. Liebman, and Stephen E. Stein
DH - Eugene S. Domalski and Elizabeth D. Hearing
Quantity | Value | Units | Method | Reference | Comment |
---|---|---|---|---|---|
ΔfH°liquid | -202. | kJ/mol | Ccb | Pushin, 1954 | Author's hf298_condensed=-50.6 kcal/mol; ALS |
Quantity | Value | Units | Method | Reference | Comment |
ΔcH°liquid | -3696. | kJ/mol | Ccb | Pushin, 1954 | Author's hf298_condensed=-50.6 kcal/mol; Corresponding ΔfHºliquid = -202. kJ/mol (simple calculation by NIST; no Washburn corrections); ALS |
Quantity | Value | Units | Method | Reference | Comment |
ΔfH°solid | -204.3 | kJ/mol | Ccb | Cox, 1961 | ALS |
ΔfH°solid | -204.6 ± 0.92 | kJ/mol | Ccb | Andon, Biddiscombe, et al., 1960 | ALS |
Quantity | Value | Units | Method | Reference | Comment |
ΔcH°solid | -3693.6 ± 0.42 | kJ/mol | Ccb | Cox, 1961 | Corresponding ΔfHºsolid = -204.3 kJ/mol (simple calculation by NIST; no Washburn corrections); ALS |
ΔcH°solid | -3693.3 ± 1.0 | kJ/mol | Ccb | Andon, Biddiscombe, et al., 1960 | Corresponding ΔfHºsolid = -204.6 kJ/mol (simple calculation by NIST; no Washburn corrections); ALS |
ΔcH°solid | -3697. | kJ/mol | Ccb | Barker, 1925 | Author was aware that data differs from previously reported values; Corresponding ΔfHºsolid = -200. kJ/mol (simple calculation by NIST; no Washburn corrections); ALS |
Quantity | Value | Units | Method | Reference | Comment |
S°solid,1 bar | 165.44 | J/mol*K | N/A | Andon, Counsell, et al., 1967 | DH |
Constant pressure heat capacity of liquid
Cp,liquid (J/mol*K) | Temperature (K) | Reference | Comment |
---|---|---|---|
233.6 | 313. | Rastorguev and Ganiev, 1967 | T = 313 to 373 K.; DH |
225.9 | 283. | Bramley, 1916 | Mean value, 0 to 20 C.; DH |
Constant pressure heat capacity of solid
Cp,solid (J/mol*K) | Temperature (K) | Reference | Comment |
---|---|---|---|
154.56 | 298.15 | Andon, Counsell, et al., 1967 | T = 10 to 400 K.; DH |

Phase change data

Data compiled as indicated in comments:
BS - Robert L. Brown and Stephen E. Stein
TRC - Thermodynamics Research Center, NIST Boulder Laboratories, Chris Muzny director
ALS - Hussein Y. Afeefy, Joel F. Liebman, and Stephen E. Stein
AC - William E. Acree, Jr., James S. Chickos
DRB - Donald R. Burgess, Jr.
DH - Eugene S. Domalski and Elizabeth D. Hearing
Quantity | Value | Units | Method | Reference | Comment |
---|---|---|---|---|---|
Tboil | 464.3 ± 0.6 | K | AVG | N/A | Average of 11 out of 12 values; Individual data points |
Quantity | Value | Units | Method | Reference | Comment |
Tfus | 304. ± 1. | K | AVG | N/A | Average of 15 values; Individual data points |
Quantity | Value | Units | Method | Reference | Comment |
Ttriple | 304.20 | K | N/A | Andon, Counsell, et al., 1967, 2 | Uncertainty assigned by TRC = 0.02 K; TRC |
Quantity | Value | Units | Method | Reference | Comment |
Tc | 697.6 | K | N/A | Delaunois, 1968 | Uncertainty assigned by TRC = 0.4 K; TRC |
Tc | 697.55 | K | N/A | Ambrose, 1963 | Uncertainty assigned by TRC = 0.23 K; TRC |
Tc | 695.15 | K | N/A | Glaser and Ruland, 1957 | Uncertainty assigned by TRC = 2. K; TRC |
Tc | 695.5 | K | N/A | Radice, 1899 | Uncertainty assigned by TRC = 3. K; TRC |
Quantity | Value | Units | Method | Reference | Comment |
Pc | 41.70 | bar | N/A | Delaunois, 1968 | Uncertainty assigned by TRC = 0.3922 bar; TRC |
Pc | 48.636 | bar | N/A | Glaser and Ruland, 1957 | Uncertainty assigned by TRC = 3.0398 bar; TRC |
Pc | 50.0546 | bar | N/A | Herz and Neukirch, 1923 | Uncertainty assigned by TRC = 0.7092 bar; TRC |
Quantity | Value | Units | Method | Reference | Comment |
ΔvapH° | 44.89 | kJ/mol | C | Glaser and Ruland, 1957 | ALS |
Quantity | Value | Units | Method | Reference | Comment |
ΔsubH° | 73.7 ± 0.5 | kJ/mol | C | Richard, Bernardes, et al., 2007 | AC |
ΔsubH° | 76.0 | kJ/mol | N/A | Cox, 1961 | DRB |
ΔsubH° | 76.02 ± 0.75 | kJ/mol | V | Andon, Biddiscombe, et al., 1960 | ALS |
ΔsubH° | 76.0 | kJ/mol | N/A | Andon, Biddiscombe, et al., 1960 | DRB |
Enthalpy of vaporization
ΔvapH (kJ/mol) | Temperature (K) | Method | Reference | Comment |
---|---|---|---|---|
58.5 | 319. | A | Stephenson and Malanowski, 1987 | Based on data from 304. to 409. K.; AC |
50.1 | 414. | A | Stephenson and Malanowski, 1987 | Based on data from 399. to 470. K.; AC |
46.2 | 478. | A | Stephenson and Malanowski, 1987 | Based on data from 463. to 526. K.; AC |
44.0 | 532. | A | Stephenson and Malanowski, 1987 | Based on data from 517. to 630. K.; AC |
51.3 | 398. | GS,EB | Stephenson and Malanowski, 1987 | Based on data from 383. to 473. K. See also Andon, Biddiscombe, et al., 1960, 2 and Kkykj and Repas, 1973.; AC |
48.2 | 438. | N/A | Goldblum, Martin, et al., 1947 | Based on data from 415. to 462. K.; AC |
Antoine Equation Parameters
log10(P) = A − (B / (T + C))
P = vapor pressure (bar)
T = temperature (K)
View plot Requires a JavaScript / HTML 5 canvas capable browser.
Temperature (K) | A | B | C | Reference | Comment |
---|---|---|---|---|---|
393.37 to 464.10 | 3.96775 | 1391.332 | -112.974 | Dreisbach and Shrader, 1949 | Coefficents calculated by NIST from author's data. |
Enthalpy of sublimation
ΔsubH (kJ/mol) | Temperature (K) | Method | Reference | Comment |
---|---|---|---|---|
74.8 | 288. | A | Stephenson and Malanowski, 1987 | Based on data from 273. to 303. K.; AC |
76.0 ± 0.8 | 288. | N/A | Andon, Biddiscombe, et al., 1960, 2 | Based on data from 273. to 303. K. See also Cox and Pilcher, 1970.; AC |
Enthalpy of fusion
ΔfusH (kJ/mol) | Temperature (K) | Method | Reference | Comment |
---|---|---|---|---|
14.800 | 304.05 | N/A | Meva'a and Lichanot, 1990 | DH |
13.938 | 303.0 | N/A | Poeti, Fanelli, et al., 1982 | DH |
15.820 | 304.20 | N/A | Andon, Counsell, et al., 1967 | DH |
14.8 | 305.4 | DSC | Richard, Bernardes, et al., 2007 | AC |
15.9 | 304.1 | DSC | Jamróz, Palczewska-Tulinska, et al., 1998 | AC |
15.82 | 304.2 | N/A | Domalski and Hearing, 1996 | AC |
14.8 | 304.1 | N/A | Meva'a and Lichanot, 1990 | AC |
Entropy of fusion
ΔfusS (J/mol*K) | Temperature (K) | Reference | Comment |
---|---|---|---|
49. | 304.05 | Meva'a and Lichanot, 1990 | DH |
46.00 | 303.0 | Poeti, Fanelli, et al., 1982 | DH |
52.00 | 304.20 | Andon, Counsell, et al., 1967 | DH |

Gas phase ion energetics data

Data compiled as indicated in comments:
B - John E. Bartmess
MM - Michael M. Meot-Ner (Mautner)
LL - Sharon G. Lias and Joel F. Liebman
LBLHLM - Sharon G. Lias, John E. Bartmess, Joel F. Liebman, John L. Holmes, Rhoda D. Levin, and W. Gary Mallard
LLK - Sharon G. Lias, Rhoda D. Levin, and Sherif A. Kafafi
RDSH - Henry M. Rosenstock, Keith Draxl, Bruce W. Steiner, and John T. Herron
Proton affinity at 298K
Proton affinity (kJ/mol) | Reference | Comment |
---|---|---|
832. ± 8. | van Beelen, Koblenz, et al., 2004 | T = 298K; PA derived by authors from GB with protonation entropy equated to Rlnσ(B)/σ(BH+); MM |
Gas basicity at 298K
Gas basicity (review) (kJ/mol) | Reference | Comment |
---|---|---|
800. ± 8. | van Beelen, Koblenz, et al., 2004 | T = 298K; PA derived by authors from GB with protonation entropy equated to Rlnσ(B)/σ(BH+); MM |
Ionization energy determinations
IE (eV) | Method | Reference | Comment |
---|---|---|---|
8.14 | EI | Russell, Freiser, et al., 1983 | LBLHLM |
8.24 ± 0.02 | PE | Maier and Turner, 1973 | LLK |
8.93 | EI | Crable and Kearns, 1962 | RDSH |
8.46 ± 0.06 | EI | Selim, Fahmey, et al., 1991 | Vertical value; LL |
8.50 | PE | Palmer, Moyes, et al., 1979 | Vertical value; LLK |
8.48 | PE | Kobayashi and Nagakura, 1974 | Vertical value; LLK |
Appearance energy determinations
Ion | AE (eV) | Other Products | Method | Reference | Comment |
---|---|---|---|---|---|
C6H5+ | 14.86 ± 0.09 | ? | EI | Selim, Fahmey, et al., 1990 | LL |
C6H7+ | 11.33 | CHO | EI | Russell, Freiser, et al., 1983 | LBLHLM |
C7H7+ | 11.26 ± 0.10 | OH | EI | Selim, Fahmey, et al., 1990 | LL |
C7H7O+ | 11.20 | H | EI | Russell, Freiser, et al., 1983 | LBLHLM |
De-protonation reactions
C7H7O- + =
By formula: C7H7O- + H+ = C7H8O
Quantity | Value | Units | Method | Reference | Comment |
---|---|---|---|---|---|
ΔrH° | 1462. ± 9.2 | kJ/mol | G+TS | Fujio, McIver, et al., 1981 | gas phase; value altered from reference due to change in acidity scale; B |
ΔrH° | 1465. ± 12. | kJ/mol | G+TS | Kebarle and McMahon, 1977 | gas phase; B |
Quantity | Value | Units | Method | Reference | Comment |
ΔrG° | 1431. ± 8.4 | kJ/mol | IMRE | Fujio, McIver, et al., 1981 | gas phase; value altered from reference due to change in acidity scale; B |
ΔrG° | 1434. ± 8.4 | kJ/mol | IMRE | Kebarle and McMahon, 1977 | gas phase; B |

Ion clustering data

Data compiled as indicated in comments:
B - John E. Bartmess
M - Michael M. Meot-Ner (Mautner) and Sharon G. Lias
Clustering reactions
By formula: Br- + C7H8O = (Br- • C7H8O)
Quantity | Value | Units | Method | Reference | Comment |
---|---|---|---|---|---|
ΔrH° | 86.2 ± 7.5 | kJ/mol | IMRE | Paul and Kebarle, 1990 | gas phase; ΔGaff at 423 K; B,M |
Quantity | Value | Units | Method | Reference | Comment |
ΔrS° | 96. | J/mol*K | N/A | Paul and Kebarle, 1990 | gas phase; Entropy change calculated or estimated; M |
Quantity | Value | Units | Method | Reference | Comment |
ΔrG° | 45.6 ± 4.2 | kJ/mol | IMRE | Paul and Kebarle, 1990 | gas phase; ΔGaff at 423 K; B |
Free energy of reaction
ΔrG° (kJ/mol) | T (K) | Method | Reference | Comment |
---|---|---|---|---|
45.6 | 423. | PHPMS | Paul and Kebarle, 1990 | gas phase; Entropy change calculated or estimated; M |

Henry's Law data

Data compiled by: Rolf Sander
Henry's Law constant (water solution)
kH(T) = k°H exp(d(ln(kH))/d(1/T) ((1/T) - 1/(298.15 K)))
k°H = Henry's law constant for solubility in water at 298.15 K (mol/(kg*bar))
d(ln(kH))/d(1/T) = Temperature dependence constant (K)
k°H (mol/(kg*bar)) | d(ln(kH))/d(1/T) (K) | Method | Reference | Comment |
---|---|---|---|---|
1200. | Q | N/A | missing citation give several references for the Henry's law constants but don't assign them to specific species. Value at T = 293. K. | |
820. | X | N/A | ||
260. | 4600. | X | N/A | |
830. | X | N/A | Value given here as quoted by missing citation. | |
820. | 7300. | M | N/A | It is assumed here that the thermodynamic data in missing citation refers to the units [mol/dm3] and [atm] as standard states. |

Reaction thermochemistry data

Data compiled as indicated in comments:
B - John E. Bartmess
M - Michael M. Meot-Ner (Mautner) and Sharon G. Lias
ALS - Hussein Y. Afeefy, Joel F. Liebman, and Stephen E. Stein
Individual Reactions
By formula: Br- + C7H8O = (Br- • C7H8O)
Quantity | Value | Units | Method | Reference | Comment |
---|---|---|---|---|---|
ΔrH° | 20.6 ± 1.8 | kcal/mol | IMRE | Paul and Kebarle, 1990 | gas phase; ΔGaff at 423 K; B,M |
Quantity | Value | Units | Method | Reference | Comment |
ΔrS° | 23. | cal/mol*K | N/A | Paul and Kebarle, 1990 | gas phase; Entropy change calculated or estimated; M |
Quantity | Value | Units | Method | Reference | Comment |
ΔrG° | 10.9 ± 1.0 | kcal/mol | IMRE | Paul and Kebarle, 1990 | gas phase; ΔGaff at 423 K; B |
Free energy of reaction
ΔrG° (kcal/mol) | T (K) | Method | Reference | Comment |
---|---|---|---|---|
10.9 | 423. | PHPMS | Paul and Kebarle, 1990 | gas phase; Entropy change calculated or estimated; M |
C7H7O- + =
By formula: C7H7O- + H+ = C7H8O
Quantity | Value | Units | Method | Reference | Comment |
---|---|---|---|---|---|
ΔrH° | 349.5 ± 2.2 | kcal/mol | G+TS | Fujio, McIver, et al., 1981 | gas phase; value altered from reference due to change in acidity scale; B |
ΔrH° | 350.2 ± 2.9 | kcal/mol | G+TS | Kebarle and McMahon, 1977 | gas phase; B |
Quantity | Value | Units | Method | Reference | Comment |
ΔrG° | 342.0 ± 2.0 | kcal/mol | IMRE | Fujio, McIver, et al., 1981 | gas phase; value altered from reference due to change in acidity scale; B |
ΔrG° | 342.7 ± 2.0 | kcal/mol | IMRE | Kebarle and McMahon, 1977 | gas phase; B |
By formula: C15H24O + C7H8O = C11H16O + C11H16O
Quantity | Value | Units | Method | Reference | Comment |
---|---|---|---|---|---|
ΔrH° | 0.60 ± 0.84 | kcal/mol | Eqk | Nesterova, Verevkin, et al., 1985 | liquid phase; ALS |

Van Den Dool and Kratz RI, non-polar column, temperature ramp

Data compiled by: NIST Mass Spectrometry Data Center, William E. Wallace, director

Column type CapillaryCapillaryCapillaryCapillaryCapillary
Active phase CP Sil 8 CBRTX-5CP-Sil 8CB-MSHP-5MSDB-1
Column length (m) 50.30.60.30.30.
Carrier gas  N2 HeHe
Substrate
Column diameter (mm) 0.320.250.250.250.25
Phase thickness (μm)  0.250.250.250.25
Tstart (C) 60.40.40.60.40.
Tend (C) 220.300.280.280.325.
Heat rate (K/min) 4.5.4.3.3.
Initial hold (min) 5.2.2.
Final hold (min) 30.10.5.
I 1052.1042.71071.1073.1031.1
ReferenceMahadevan and Farmer, 2006Ádámová, Orinák, et al., 2005Hierro, de la Hoz, et al., 2004Mimica-Dukic, Kujundzic, et al., 2003Sun and Stremple, 2003
Comment MSDC-RI MSDC-RI MSDC-RI MSDC-RI MSDC-RI
Column type CapillaryCapillaryCapillaryCapillaryCapillary
Active phase CP Sil 8 CBCP Sil 8 CB5 % Phenyl methyl siloxaneOV-1DB-1
Column length (m) 50.50.25. 30.
Carrier gas   He N2
Substrate
Column diameter (mm) 0.320.32  0.32
Phase thickness (μm)     0.25
Tstart (C) 60.60.80.35.150.
Tend (C) 220.220.300.300.280.
Heat rate (K/min) 4.4.20.8.3.
Initial hold (min) 5.5.3.
Final hold (min) 30.30.0.
I 1054.1080.1042.1029.71032.
ReferenceChevance and Farmer, 1999Chevance and Farmer, 1999Climent and Miranda, 1996Gautzsch and Zinn, 1996Coen, Engel, et al., 1995
Comment MSDC-RI MSDC-RI MSDC-RI MSDC-RI MSDC-RI
Column type CapillaryCapillaryCapillaryCapillary
Active phase DB-1DB-1DB-1DB-5
Column length (m) 30.30.60.30.
Carrier gas N2N2 He
Substrate
Column diameter (mm) 0.2350.2350.320.26
Phase thickness (μm) 0.250.251.0.25
Tstart (C) 50.50.-50.50.
Tend (C)   180.300.
Heat rate (K/min) 10.5.6.6.
Initial hold (min) 0.0.4.4.
Final hold (min)    20.
I 1042.1044.1029.1055.
ReferenceGerbino and Castello, 1995Gerbino and Castello, 1995Kaiser and Siegl, 1994Rostad and Pereira, 1986
Comment MSDC-RI MSDC-RI MSDC-RI MSDC-RI

Lee's RI, non-polar column, temperature ramp

Data compiled by: NIST Mass Spectrometry Data Center, William E. Wallace, director

Column type CapillaryCapillaryCapillaryCapillaryCapillary
Active phase HP-5HP-5DB-5DB-5DB-5
Column length (m) 30.30.25.30.30.
Carrier gas HeliumHeHeHeHe
Substrate
Column diameter (mm) 0.300.30.30.320.32
Phase thickness (μm) 0.250.25 0.250.25
Tstart (C) 50.50.60.40.40.
Tend (C) 200.200.270.285.285.
Heat rate (K/min) 5.5.5.8.8.
Initial hold (min) 5.5.2.3.3.
Final hold (min) 15.15. 29.529.5
I 170.2170.3172.54170.9171.3
ReferenceWang, Hou, et al., 2007Shao, Wang, et al., 2006Williams and Horne, 1995Donnelly, Abdel-Hamid, et al., 1993Donnelly, Abdel-Hamid, et al., 1993
Comment MSDC-RI MSDC-RI MSDC-RI MSDC-RI MSDC-RI
Column type Capillary
Active phase DB-5
Column length (m) 30.
Carrier gas He
Substrate
Column diameter (mm) 0.26
Phase thickness (μm) 0.25
Tstart (C) 50.
Tend (C) 300.
Heat rate (K/min) 6.
Initial hold (min) 4.
Final hold (min) 20.
I 172.86
ReferenceRostad and Pereira, 1986
Comment MSDC-RI

Kovats' RI, polar column, isothermal

Data compiled by: NIST Mass Spectrometry Data Center, William E. Wallace, director

Column type PackedPacked
Active phase Carbowax 20MPEG-2000
Column length (m) 2.3.
Carrier gas  He
Substrate  Celite 545 (44-60 mesh)
Column diameter (mm)
Phase thickness (μm)
Temperature (C) 220.200.
I 2004.1980.
ReferenceSellier, Tersac, et al., 1981Anderson, Jurel, et al., 1973
Comment MSDC-RI MSDC-RI

Normal alkane RI, polar column, temperature ramp

Data compiled by: NIST Mass Spectrometry Data Center, William E. Wallace, director

Column type CapillaryCapillaryCapillaryCapillaryCapillary
Active phase DB-FFAPAT-WaxFFAPHP-InnowaxSupelcowax-10
Column length (m) 30.60.60.30.30.
Carrier gas HeliumHeliumHeliumHeliumHelium
Substrate
Column diameter (mm) 0.320.250.250.250.25
Phase thickness (μm) 0.250.250.250.250.25
Tstart (C) 40.60.45.50.50.
Tend (C) 230.280.220.250.240.
Heat rate (K/min) 8.4.5.6.58.
Initial hold (min) 2. 1.1.510.
Final hold (min) 5. 5.10.
I 2000.2021.1992.1993.1992.
ReferenceCzerny, Brueckner, et al., 2011Kiss, Csoka, et al., 2011Piyachaiseth, Jirapakkul, et al., 2011Thakeow, Angeli, et al., 2008Vichi, Romero, et al., 2008
Comment MSDC-RI MSDC-RI MSDC-RI MSDC-RI MSDC-RI
Column type CapillaryCapillaryCapillaryCapillaryCapillary
Active phase DB-WaxDB-Wax EtrTC-WaxTC-WaxSupelcowax
Column length (m) 30.60.60.60.60.
Carrier gas N2HeHe He
Substrate
Column diameter (mm) 0.320.250.250.250.25
Phase thickness (μm) 0.250.25
Tstart (C) 40.40.80.80.80.
Tend (C) 230.230.250.240.240.
Heat rate (K/min) 6.2.4.3.5.
Initial hold (min) 2.5.
Final hold (min) 15.100.30.
I 2011.2030.2008.1995.2050.
ReferenceFan and Qian, 2006Ibarz, Ferreira, et al., 2006Miyazawa and Okuno, 2003Miyazawa, Yamafuji, et al., 2003Näf and Velluz, 1998
Comment MSDC-RI MSDC-RI MSDC-RI MSDC-RI MSDC-RI
Column type CapillaryCapillaryCapillary
Active phase TC-WaxCarbowax 20MCarbowax 20M
Column length (m) 60.60.50.
Carrier gas   He
Substrate
Column diameter (mm) 0.250.250.25
Phase thickness (μm)
Tstart (C) 80.60.60.
Tend (C) 240.180.180.
Heat rate (K/min) 3.2.2.
Initial hold (min) 5.4.4.
Final hold (min)
I 2007.2025.2025.
ReferenceShuichi, Masazumi, et al., 1996Kawakami, Ganguly, et al., 1995Kawakami and Kobayashi, 1991
Comment MSDC-RI MSDC-RI MSDC-RI

Kovats' RI, non-polar column, custom temperature program

Data compiled by: NIST Mass Spectrometry Data Center, William E. Wallace, director

Column type Packed
Active phase SE-30
Column length (m) 2.9
Carrier gas
Substrate Chromosorb W HMDS (80-100 mesh)
Column diameter (mm)
Phase thickness (μm)
Program not specified
I 1035.
ReferenceGrzybowski, Lamparczyk, et al., 1980
Comment MSDC-RI

Kovats' RI, non-polar column, temperature ramp

Data compiled by: NIST Mass Spectrometry Data Center, William E. Wallace, director

Column type Capillary
Active phase CBP-1
Column length (m) 25.
Carrier gas He
Substrate
Column diameter (mm) 0.2
Phase thickness (μm) 0.25
Tstart (C) 50.
Tend (C) 200.
Heat rate (K/min) 4.
Initial hold (min) 5.
Final hold (min)
I 1039.
ReferenceShimadzu, 2003
Comment MSDC-RI

References

Cox, 1961
Cox, J.D.,
The heats of combustion of phenol and the three cresols,
Pure Appl. Chem., 1961, 2, 125-128. [all data]
Andon, Biddiscombe, et al., 1960
Andon, R.J.L.; Biddiscombe, D.P.; Cox, J.D.; Handley, R.; Harrop, D.; Herington, E.F.G.; Martin, J.F.,
Thermodynamic properties of organic oxygen compounds. Part I. Preparation and physical properties of pure phenol, cresols, and xylenols,
J. Chem. Soc., 1960, 5246-5254. [all data]
Kudchadker S.A., 1978
Kudchadker S.A.,
Ideal gas thermodynamic properties of phenol and cresols,
J. Phys. Chem. Ref. Data, 1978, 7, 417-423. [all data]
Green J.H.S., 1962
Green J.H.S.,
Normal frequencies, thermodynamic properties and equilibrium of the cresols,
Chem. Ind. (London), 1962, 1575-1576. [all data]
Pushin, 1954
Pushin, N.A.,
Heats of combustion and heats of formation of isomeric organic compounds,
Bull. Soc. Chim. Belgrade, 1954, 19, 531-547. [all data]
Barker, 1925
Barker, M.F.,
Calorific value and constitution,
J. Phys. Chem., 1925, 29, 1345-1363. [all data]
Andon, Counsell, et al., 1967
Andon, R.J.L.; Counsell, J.F.; Lees, E.B.; Martin, J.F.; Mash, C.J.,
Thermodynamic properties of organic oxygen compounds. Part 17. Low-temperature heat capacity and entropy of the cresols,
Trans. Faraday Soc., 1967, 63, 1115-1121. [all data]
Rastorguev and Ganiev, 1967
Rastorguev, Yu.L.; Ganiev, Yu.A.,
Study of the heat capacity of selected solvents,
Izv. Vyssh. Uchebn. Zaved. Neft Gaz. 10, 1967, No.1, 79-82. [all data]
Bramley, 1916
Bramley, A.,
The study of binary mixtures. Part IV. Heats of reaction and specific heats,
J. Chem. Soc. (London), 1916, 109, 496-515. [all data]
Andon, Counsell, et al., 1967, 2
Andon, R.J.L.; Counsell, J.F.; Lees, E.B.; Martin, J.F.; Mash, C.J.,
Thermodynamic Properties of Organic Oxygen Compounds Part 17. Low- temperature Heat Capacity and Entropy of the Cresols,
Trans. Faraday Soc., 1967, 63, 1115. [all data]
Delaunois, 1968
Delaunois, C.,
Effect of the Filling Rate of a Reactor on the Vapor Tension and the Temperature at the Beginning of Cracking of Phenols at High Pressures,
Ann. Mines Belg., 1968, No. 1, 9-16. [all data]
Ambrose, 1963
Ambrose, D.,
Critical Temperatures of Some Phenols and Other Organic Compounds,
Trans. Faraday Soc., 1963, 59, 1988. [all data]
Glaser and Ruland, 1957
Glaser, F.; Ruland, H.,
Untersuchungsen über dampfdruckkurven und kritische daten einiger technisch wichtiger organischer substanzen,
Chem. Ing. Techn., 1957, 29, 772. [all data]
Radice, 1899
Radice, G.,
, Ph. D. Thesis, Univ. of Geneve, 1899. [all data]
Herz and Neukirch, 1923
Herz, W.; Neukirch, E.,
On Knowldge of the Critical State,
Z. Phys. Chem., Stoechiom. Verwandtschaftsl., 1923, 104, 433-50. [all data]
Richard, Bernardes, et al., 2007
Richard, Laurence S.; Bernardes, Carlos E.S.; Diogo, Hermínio P.; Leal, João P.; Minas da Piedade, Manuel E.,
Energetics of Cresols and of Methylphenoxyl Radicals,
J. Phys. Chem. A, 2007, 111, 35, 8741-8748, https://doi.org/10.1021/jp073515m
. [all data]
Stephenson and Malanowski, 1987
Stephenson, Richard M.; Malanowski, Stanislaw,
Handbook of the Thermodynamics of Organic Compounds, 1987, https://doi.org/10.1007/978-94-009-3173-2
. [all data]
Andon, Biddiscombe, et al., 1960, 2
Andon, R.J.L.; Biddiscombe, D.P.; Cox, J.D.; Handley, R.; Harrop, D.; Herington, E.F.G.; Martin, J.F.,
1009. Thermodynamic properties of organic oxygen compounds. Part I. Preparation and physical properties of pure phenol, cresols, and xylenols,
J. Chem. Soc., 1960, 5246, https://doi.org/10.1039/jr9600005246
. [all data]
Kkykj and Repas, 1973
Kkykj, J.; Repas, M.,
Petrochemia, 1973, 13, 179. [all data]
Goldblum, Martin, et al., 1947
Goldblum, K.B.; Martin, R.W.; Young, R.B.,
Vapor Pressure Data for Phenols,
Ind. Eng. Chem., 1947, 39, 11, 1474-1476, https://doi.org/10.1021/ie50455a017
. [all data]
Dreisbach and Shrader, 1949
Dreisbach, R.R.; Shrader, S.A.,
Vapor Pressure--Temperature Data on Some Organic Compounds,
Ind. Eng. Chem., 1949, 41, 12, 2879-2880, https://doi.org/10.1021/ie50480a054
. [all data]
Cox and Pilcher, 1970
Cox, J.D.; Pilcher, G.,
Thermochemistry of Organic and Organometallic Compounds, Academic Press Inc., London, 1970, 643. [all data]
Meva'a and Lichanot, 1990
Meva'a, L.M.; Lichanot, A.,
Proprietes thermodynamiques en phase condensee des ortho, meta et para fluorotoluene, cresol et toluidine,
Thermochim. Acta, 1990, 158, 335-345. [all data]
Poeti, Fanelli, et al., 1982
Poeti, G.; Fanelli, E.; Braghetti, M.,
A differential scanning calorimetric study of some phenol derivatives,
J. Therm. Anal., 1982, 24(2), 273-279. [all data]
Jamróz, Palczewska-Tulinska, et al., 1998
Jamróz, Malgorzata E.; Palczewska-Tulinska, Marcela; Wyrzykowska-Stankiewicz, Danuta; Szafranski, Andrzej M.; Polaczek, Jerzy; Dobrowolski, Jan Cz.; Jamróz, Michal H.; Mazurek, Aleksander P.,
The urea--phenol(s) systems,
Fluid Phase Equilibria, 1998, 152, 2, 307-326, https://doi.org/10.1016/S0378-3812(98)90206-0
. [all data]
Domalski and Hearing, 1996
Domalski, Eugene S.; Hearing, Elizabeth D.,
Heat Capacities and Entropies of Organic Compounds in the Condensed Phase. Volume III,
J. Phys. Chem. Ref. Data, 1996, 25, 1, 1, https://doi.org/10.1063/1.555985
. [all data]
van Beelen, Koblenz, et al., 2004
van Beelen, E.S.E.; Koblenz, T.A.; Ingemann, S.; Hammerum, S.,
Experimental and theoretical evaluation of proton affinities of furan, the methylphenols, and the related anisoles,
J. Phys. Chem. A, 2004, 108, 2787. [all data]
Russell, Freiser, et al., 1983
Russell, D.H.; Freiser, B.S.; McBay, E.H.; Canada, D.C.,
The structure of decomposing [C7H7O]+ ions: Benzyl versus tropylium ion structures,
Org. Mass Spectrom., 1983, 18, 474. [all data]
Maier and Turner, 1973
Maier, J.P.; Turner, D.W.,
Steric inhibition of resonance studied by molecular photoelectron spectroscopy. Part 2. Phenylethylenes,
J. Chem. Soc. Faraday Trans. 2, 1973, 69, 196. [all data]
Crable and Kearns, 1962
Crable, G.F.; Kearns, G.L.,
Effect of substituent groups on the ionization potentials of benzenes,
J. Phys. Chem., 1962, 66, 436. [all data]
Selim, Fahmey, et al., 1991
Selim, E.T.M.; Fahmey, M.A.; Ghonime, H.S.,
Mass spectrometric study of molecular ions of methyl-phenol isomers using electron impact technique,
Indian J. Phys., 1991, 65, 171. [all data]
Palmer, Moyes, et al., 1979
Palmer, M.H.; Moyes, W.; Speirs, M.; Ridyard, J.N.A.,
The electronic structure of substituted benzenes; ab initio calculations and photoelectron spectra for phenol, the methyl- and fluoro-derivatives, and the dihydroxybenzenes,
J. Mol. Struct., 1979, 52, 293. [all data]
Kobayashi and Nagakura, 1974
Kobayashi, T.; Nagakura, S.,
Photoelectron spectra of substituted benzenes,
Bull. Chem. Soc. Jpn., 1974, 47, 2563. [all data]
Selim, Fahmey, et al., 1990
Selim, E.T.M.; Fahmey, M.A.; Ghonime, H.S.,
[C7H7]+ and [C6H5]+ fragment ions produced from methylphenol isomers by electron impact,
Org. Mass Spectrom., 1990, 26, 55. [all data]
Fujio, McIver, et al., 1981
Fujio, M.; McIver, R.T., Jr.; Taft, R.W.,
Effects on the acidities of phenols from specific substituent-solvent interactions. Inherent substituent parameters from gas phase acidities,
J. Am. Chem. Soc., 1981, 103, 4017. [all data]
Kebarle and McMahon, 1977
Kebarle, P.; McMahon, T.B.,
Intrinsic Acidities of Substituted Phenols and Benzoic Acids Determined by Gas Phase Proton Transfer Equilibria,
J. Am. Chem. Soc., 1977, 99, 7, 2222, https://doi.org/10.1021/ja00449a032
. [all data]
Paul and Kebarle, 1990
Paul, G.J.C.; Kebarle, P.,
Stabilities in the Gas Phase of the Hydrogen Bonded Complexes, YC6H4OH-X-, of Substituted Phenols, YC6H4OH, with the Halide Anions X-(Cl-, Br-),
Can. J. Chem., 1990, 68, 11, 2070, https://doi.org/10.1139/v90-316
. [all data]