1H-Indole, 2-methyl-
- Formula: C9H9N
- Molecular weight: 131.1745
- IUPAC Standard InChIKey: BHNHHSOHWZKFOX-UHFFFAOYSA-N
- CAS Registry Number: 95-20-5
- Chemical structure:
View 3d structure (requires JavaScript / HTML 5) - Other names: Indole, 2-methyl-; 2-Methyl-1H-indole; 2-Methylindole

Phase change data

Data compiled as indicated in comments:
BS - Robert L. Brown and Stephen E. Stein
TRC - Thermodynamics Research Center, NIST Boulder Laboratories, Chris Muzny director
AC - William E. Acree, Jr., James S. Chickos
Quantity | Value | Units | Method | Reference | Comment |
---|---|---|---|---|---|
Tboil | 545.2 | K | N/A | Weast and Grasselli, 1989 | BS |
Tboil | 543. | K | N/A | Adkins and Coonradt, 1941 | Uncertainty assigned by TRC = 4. K; TRC |
Quantity | Value | Units | Method | Reference | Comment |
ΔsubH° | 88.7 ± 2.4 | kJ/mol | C | Ribeiro da Silva, Cabral, et al., 2009 | AC |
Enthalpy of fusion
ΔfusH (kJ/mol) | Temperature (K) | Reference | Comment |
---|---|---|---|
15.72 | 329.4 | Peyrot, Letoffe, et al., 1997 | AC |

Gas phase ion energetics data

Data evaluated as indicated in comments:
L - Sharon G. Lias
Data compiled as indicated in comments:
LL - Sharon G. Lias and Joel F. Liebman
LLK - Sharon G. Lias, Rhoda D. Levin, and Sherif A. Kafafi
Quantity | Value | Units | Method | Reference | Comment |
---|---|---|---|---|---|
IE (evaluated) | 7.671 ± 0.001 | eV | N/A | N/A | L |
Ionization energy determinations
IE (eV) | Method | Reference | Comment |
---|---|---|---|
7.6708 ± 0.0006 | LS | Hager and Wallace, 1988 | LL |
7.44 ± 0.015 | PE | Gusten, Klasinc, et al., 1976 | LLK |

Kovats' RI, non-polar column, isothermal

Column type | Active phase | Temperature (C) | I | Reference | Comment |
---|---|---|---|---|---|
Packed | SE-30 | 170. | 1385. | Tibor and Anna, 1971 | N2, Chromosorb W-AW; Column length: 2. m |
Packed | SE-30 | 190. | 1400. | Tibor and Anna, 1971 | N2, Chromosorb W-AW; Column length: 2. m |

Kovats' RI, polar column, isothermal

Column type | Active phase | Temperature (C) | I | Reference | Comment |
---|---|---|---|---|---|
Packed | PEG-20M | 170. | 2425. | Tibor and Anna, 1971 | N2, Chromosorb W-AW; Column length: 2. m |

Van Den Dool and Kratz RI, non-polar column, temperature ramp

Column type | Active phase | I | Reference | Comment |
---|---|---|---|---|
Capillary | DB-5 | 1373. | Rostad and Pereira, 1986 | 30. m/0.26 mm/0.25 μm, He, 50. C @ 4. min, 6. K/min, 300. C @ 20. min |

Lee's RI, non-polar column, temperature ramp

Column type | Active phase | I | Reference | Comment |
---|---|---|---|---|
Capillary | DB-5 | 234.59 | Rostad and Pereira, 1986 | 30. m/0.26 mm/0.25 μm, He, 50. C @ 4. min, 6. K/min, 300. C @ 20. min |
Capillary | SE-52 | 240.10 | Vassilaros, Kong, et al., 1982 | 20. m/0.30 mm/0.25 μm, H2, 40. C @ 2. min, 4. K/min; Tend: 265. C |
Capillary | SE-52 | 237.42 | Lee, Vassilaros, et al., 1979 | 12. m/0.3 mm/0.34 μm, He, 2. K/min; Tstart: 50. C; Tend: 250. C |

References

Weast and Grasselli, 1989
CRC Handbook of Data on Organic Compounds, 2nd Editon, Weast,R.C and Grasselli, J.G., ed(s)., CRC Press, Inc., Boca Raton, FL, 1989, 1. [all data]
Adkins and Coonradt, 1941
Adkins, H.; Coonradt, H.L.,
The Selective Hydrogenation of Derivatives of Pyrrole, Indole, Carbazole and Acridine,
J. Am. Chem. Soc., 1941, 63, 1563-70. [all data]
Ribeiro da Silva, Cabral, et al., 2009
Ribeiro da Silva, Manuel A.V.; Cabral, Joana I.T.A.; Gomes, José R.B.,
Combined experimental and computational study of the energetics of methylindoles,
The Journal of Chemical Thermodynamics, 2009, 41, 11, 1193-1198, https://doi.org/10.1016/j.jct.2009.05.018
. [all data]
Peyrot, Letoffe, et al., 1997
Peyrot, L.; Letoffe, J.M.; Elkhatib, M.; Scharff, J.P.; Delalu, H.,
Thermochemical study of derivatives of an indole hydrazine of pharmaceutical interest,
Calorim. Anal. Therm., 1997, 28, 298. [all data]
Hager and Wallace, 1988
Hager, J.W.; Wallace, S.C.,
Two-laser photoionization supersonic jet mass spectrometry of aromatic molecules,
Anal. Chem., 1988, 60, 5. [all data]
Gusten, Klasinc, et al., 1976
Gusten, H.; Klasinc, L.; Ruscic, B.,
Photoelectron spectroscopy of J. Heterocycl. Chem.. Indene analogs,
Z. Naturforsch. A:, 1976, 31, 1051. [all data]
Tibor and Anna, 1971
Tibor, T.; Anna, B.,
Gázkromatográfiás retenció és a kémiai szerkezet, I.,
Magy. Kem. Foly., 1971, 77, 576-587. [all data]
Rostad and Pereira, 1986
Rostad, C.E.; Pereira, W.E.,
Kovats and Lee retention indices determined by gas chromatography/mass spectrometry for organic compounds of environmental interest,
J. Hi. Res. Chromatogr. Chromatogr. Comm., 1986, 9, 6, 328-334, https://doi.org/10.1002/jhrc.1240090603
. [all data]
Vassilaros, Kong, et al., 1982
Vassilaros, D.L.; Kong, R.C.; Later, D.W.; Lee, M.L.,
Linear retention index system for polycyclic aromatic compounds. Critical evaluation and additional indices,
J. Chromatogr., 1982, 252, 1-20, https://doi.org/10.1016/S0021-9673(01)88394-1
. [all data]
Lee, Vassilaros, et al., 1979
Lee, M.L.; Vassilaros, D.L.; White, C.M.; Novotny, M.,
Retention Indices for Programmed-Temperature Capillary-Column Gas Chromatography of Polycyclic Aromatic Hydrocarbons,
Anal. Chem., 1979, 51, 6, 768-773, https://doi.org/10.1021/ac50042a043
. [all data]