Benzothiazole
- Formula: C7H5NS
- Molecular weight: 135.186
- IUPAC Standard InChIKey: IOJUPLGTWVMSFF-UHFFFAOYSA-N
- CAS Registry Number: 95-16-9
- Chemical structure:
View 3d structure (requires JavaScript / HTML 5) - Other names: Benzosulfonazole; Vangard BT; 1-Thia-3-azaindene; o-2857; USAF ek-4812; Benzothiazol; 1,3-Benzothiazole

Gas phase thermochemistry data

Data compiled by: Hussein Y. Afeefy, Joel F. Liebman, and Stephen E. Stein
Quantity | Value | Units | Method | Reference | Comment |
---|---|---|---|---|---|
ΔfH°gas | 204.17 ± 0.37 | kJ/mol | Ccr | Steele, Chirico, et al., 1992 | DSC |

Condensed phase thermochemistry data

Data compiled as indicated in comments:
ALS - Hussein Y. Afeefy, Joel F. Liebman, and Stephen E. Stein
DH - Eugene S. Domalski and Elizabeth D. Hearing
Quantity | Value | Units | Method | Reference | Comment |
---|---|---|---|---|---|
ΔfH°liquid | 144.03 ± 0.70 | kJ/mol | Ccr | Steele, Chirico, et al., 1992 | DSC; ALS |
Quantity | Value | Units | Method | Reference | Comment |
ΔcH°liquid | -4215.15 ± 0.56 | kJ/mol | Ccr | Steele, Chirico, et al., 1992 | DSC; ALS |
Quantity | Value | Units | Method | Reference | Comment |
S°liquid | 209.88 | J/mol*K | N/A | Steele, Chirico, et al., 1992, 2 | DH |
S°liquid | 209.83 | J/mol*K | N/A | Goursot and Westrum, 1969 | DH |
S°liquid | 209.83 | J/mol*K | N/A | Goursot and Westrum, 1968 | DH |
Constant pressure heat capacity of liquid
Cp,liquid (J/mol*K) | Temperature (K) | Reference | Comment |
---|---|---|---|
189.25 | 298.15 | Steele, Chirico, et al., 1992, 2 | T = 5 to 445 K.; DH |
189.54 | 298.15 | Goursot and Westrum, 1969 | T = 5 to 325 K.; DH |
189.54 | 298.15 | Goursot and Westrum, 1968 | T = 25 to 325 K.; DH |

Phase change data

Data compiled as indicated in comments:
BS - Robert L. Brown and Stephen E. Stein
TRC - Thermodynamics Research Center, NIST Boulder Laboratories, Chris Muzny director
ALS - Hussein Y. Afeefy, Joel F. Liebman, and Stephen E. Stein
AC - William E. Acree, Jr., James S. Chickos
DH - Eugene S. Domalski and Elizabeth D. Hearing
Quantity | Value | Units | Method | Reference | Comment |
---|---|---|---|---|---|
Tboil | 504.2 | K | N/A | Weast and Grasselli, 1989 | BS |
Tboil | 496. to 498. | K | N/A | Buckingham and Donaghy, 1982 | BS |
Quantity | Value | Units | Method | Reference | Comment |
Tfus | 275.29 | K | N/A | Witschonke, 1954 | Crystal phase 1 phase; Uncertainty assigned by TRC = 0.35 K; TRC |
Tfus | 276.05 | K | N/A | Witschonke, 1954 | Crystal phase 1 phase; Uncertainty assigned by TRC = 0.2 K; TRC |
Tfus | 273.88 | K | N/A | Witschonke, 1954 | Metastable crystal phase; Uncertainty assigned by TRC = 0.35 K; TRC |
Tfus | 274.95 | K | N/A | Witschonke, 1954 | Metastable crystal phase; Uncertainty assigned by TRC = 0.25 K; TRC |
Quantity | Value | Units | Method | Reference | Comment |
Ttriple | 275.650 | K | N/A | Steele, Chirico, et al., 1992, 2 | Crystal phase 1 phase; Uncertainty assigned by TRC = 0.003 K; TRC |
Ttriple | 275.60 | K | N/A | Goursot and Westrum, 1969, 2 | Uncertainty assigned by TRC = 0.01 K; TRC |
Quantity | Value | Units | Method | Reference | Comment |
ΔvapH° | 60.14 | kJ/mol | V | Steele, Chirico, et al., 1992 | DSC; ALS |
Quantity | Value | Units | Method | Reference | Comment |
ΔsubH° | 72.9 ± 0.6 | kJ/mol | B | Sabbah and Hevia, 1998 | AC |
Reduced pressure boiling point
Tboil (K) | Pressure (bar) | Reference | Comment |
---|---|---|---|
392. to 393. | 0.033 | Buckingham and Donaghy, 1982 | BS |
Enthalpy of vaporization
ΔvapH (kJ/mol) | Temperature (K) | Method | Reference | Comment |
---|---|---|---|---|
58.7 | 320. | EB | Steele, Chirico, et al., 1992, 2 | AC |
56.0 | 360. | EB | Steele, Chirico, et al., 1992, 2 | AC |
53.5 | 400. | EB | Steele, Chirico, et al., 1992, 2 | AC |
50.9 | 440. | EB | Steele, Chirico, et al., 1992, 2 | AC |
48.4 | 480. | EB | Steele, Chirico, et al., 1992, 2 | AC |
45.7 | 520. | EB | Steele, Chirico, et al., 1992, 2 | AC |
Enthalpy of fusion
ΔfusH (kJ/mol) | Temperature (K) | Method | Reference | Comment |
---|---|---|---|---|
12.782 | 275.60 | N/A | Goursot and Westrum, 1969 | DH |
12.782 | 275.596 | N/A | Goursot and Westrum, 1968 | DH |
11.95 | 275.5 | DTA | Sabbah and Hevia, 1998 | AC |
12.8 | 275.6 | N/A | Domalski and Hearing, 1996 | AC |
Entropy of fusion
ΔfusS (J/mol*K) | Temperature (K) | Reference | Comment |
---|---|---|---|
46.38 | 275.60 | Goursot and Westrum, 1969 | DH |
46.40 | 275.596 | Goursot and Westrum, 1968 | DH |
Enthalpy of phase transition
ΔHtrs (kJ/mol) | Temperature (K) | Initial Phase | Final Phase | Reference | Comment |
---|---|---|---|---|---|
0.0374 | 245.0 | crystaline, II | crystaline, I | Steele, Chirico, et al., 1992, 2 | DH |
12.591 | 275.651 | crystaline, I | liquid | Steele, Chirico, et al., 1992, 2 | DH |

Gas phase ion energetics data

Data compiled as indicated in comments:
LLK - Sharon G. Lias, Rhoda D. Levin, and Sherif A. Kafafi
RDSH - Henry M. Rosenstock, Keith Draxl, Bruce W. Steiner, and John T. Herron
Ionization energy determinations
IE (eV) | Method | Reference | Comment |
---|---|---|---|
8.72 ± 0.05 | PE | Eland, 1969 | RDSH |
8.65 | CTS | Collin and Nagels, 1961 | RDSH |
8.85 | PE | Salmona, Faure, et al., 1975 | Vertical value; LLK |

Van Den Dool and Kratz RI, non-polar column, custom temperature program

Data compiled by: NIST Mass Spectrometry Data Center, William E. Wallace, director

Column type CapillaryCapillaryCapillaryCapillaryCapillary
Active phase SPB-5DB-5MSOV-1015 % Phenyl methyl siloxaneDB-5
Column length (m) 30.30.15.25.30.
Carrier gas  HeHeHeHe
Substrate
Column diameter (mm) 0.530.320.250.310.25
Phase thickness (μm) 1.50.50.250.521.
Program 40C(1min) => 6C/min => 180C => 20C/min => 280C70C(1min) => 3C/min => 80C(1min) => 5C/min => 150C => 10C/min => 280C (4min)50C(2min) => (20C/min) => 120C => (7C/min) => 310C(10min)50C(2min) => (20C/min) => 120C => (7C/min) => 310C(10min)35C (2min) => 40C/min => 50C (1min) => 6C/min => 250C (10min)
I 1221.1258.1187.1220.1224.
ReferenceMajcher and Jelen, 2007Varlet V., Knockaert C., et al., 2006Yasuhara, Shiraishi, et al., 1997Yasuhara, Shiraishi, et al., 1997Triqui and Reineccius, 1995
Comment MSDC-RI MSDC-RI MSDC-RI MSDC-RI MSDC-RI
Column type Capillary
Active phase SE-54
Column length (m)
Carrier gas
Substrate
Column diameter (mm)
Phase thickness (μm)
Program 35C (2min) => 40C/min => 50C (1min) => 6C/min => 250C (10min)
I 1227.
ReferenceTriqui and Reineccius, 1995
Comment MSDC-RI

Normal alkane RI, non-polar column, temperature ramp

Data compiled by: NIST Mass Spectrometry Data Center, William E. Wallace, director

Column type CapillaryCapillaryCapillaryCapillaryCapillary
Active phase HP-5 MSHP-5 MSHP-5 MSDB-5 MSHP-5 MS
Column length (m) 30.30.30.30.30.
Carrier gas HeliumHelium HeliumHelium
Substrate
Column diameter (mm) 0.250.250.250.320.25
Phase thickness (μm) 0.250.250.250.250.25
Tstart (C) 50.50.60.40.60.
Tend (C) 320.320.300.230.300.
Heat rate (K/min) 5.5.15.6.15.
Initial hold (min) 5.5.2.2.2.
Final hold (min)   10.20.10.
I 1222.1222.1195.1267.1195.
ReferenceNawrath, Mgode, et al., 2012Nawrath, Mgode, et al., 2012Xu, Han, et al., 2012Chen, Song, et al., 2009Xu, Han, et al., 2009
Comment MSDC-RI MSDC-RI MSDC-RI MSDC-RI MSDC-RI
Column type CapillaryCapillaryCapillaryCapillaryCapillary
Active phase SPB-1DB-5DB-5DB-5BPX-5
Column length (m) 30.30.30.30.25.
Carrier gas HeliumHeN2HeHe
Substrate
Column diameter (mm) 0.250.320.320.250.22
Phase thickness (μm) 1.00.251.0.250.25
Tstart (C) 60.40.40.40.50.
Tend (C) 250.250.230.250.320.
Heat rate (K/min) 5.4.6.4.5.
Initial hold (min) 5.2.2.2.5.
Final hold (min)  5.15.10.
I 1201.1228.1228.1241.1248.
ReferenceFrerot, Velluz, et al., 2008Xu, Fan, et al., 2007Fan and Qian, 2006Shen X., Gao Y., et al., 2006Dickschat, Martens, et al., 2005
Comment MSDC-RI MSDC-RI MSDC-RI MSDC-RI MSDC-RI
Column type CapillaryCapillaryCapillaryCapillaryCapillary
Active phase SPB-5CP Sil 5 CBDB-5SPB-5DB-5MS
Column length (m) 30.30.60.60.30.
Carrier gas HeHeHeHeliumHe
Substrate
Column diameter (mm) 0.250.250.250.320.25
Phase thickness (μm) 0.250.250.251.0
Tstart (C) 60.40.35.30.50.
Tend (C) 250.220.280.230.280.
Heat rate (K/min) 4.4.5.3.15.
Initial hold (min) 2.1.2. 2.
Final hold (min) 20. 4. 10.
I 1221.1230.1225.1246.1199.
ReferencePino, Marbot, et al., 2005Rohloff and Bones, 2005Dhanda, Pegg, et al., 2003Sebastian, Viallon-Fernandez, et al., 2003Damon, Hernández, et al., 2002
Comment MSDC-RI MSDC-RI MSDC-RI MSDC-RI MSDC-RI
Column type CapillaryCapillaryCapillaryCapillaryCapillary
Active phase SPB-5DB-5MSSPB-5DB-5Methyl Silicone
Column length (m) 30.60.60.30.60.
Carrier gas HeliumHeHeHe
Substrate
Column diameter (mm) 0.250.250.320.250.25
Phase thickness (μm) 0.250.251.0.250.25
Tstart (C) 60.40.40.60.40.
Tend (C) 250.200.200.240.220.
Heat rate (K/min) 4.2.3.3.5.
Initial hold (min) 2.5.  10.
Final hold (min) 20.30.
I 1221.1234.1244.1218.1183.50
ReferencePino, Marbot, et al., 2002Lee, Suriyaphan, et al., 2001Poligné, Collignan, et al., 2001Tellez, Schrader, et al., 2001Baraldi, Rapparini, et al., 1999
Comment MSDC-RI MSDC-RI MSDC-RI MSDC-RI MSDC-RI
Column type CapillaryCapillaryCapillaryCapillaryCapillary
Active phase OV-1HP-5HP-1Ultra-2DB-5
Column length (m)  50.25.50.30.
Carrier gas    HeH2
Substrate
Column diameter (mm)  0.320.320.320.32
Phase thickness (μm)  0.52 0.521.
Tstart (C) 50.35.35.40.40.
Tend (C) 160.250.250.250.220.
Heat rate (K/min) 2.2.4.4.3.
Initial hold (min)  15. 3.
Final hold (min)  45. 30.
I 1200.1236.1180.1245.1234.
ReferenceOrav, Kailas, et al., 1999Boylston and Viniyard, 1998Ong, Acree, et al., 1998King, Matthews, et al., 1995Moio, Dekimpe, et al., 1993
Comment MSDC-RI MSDC-RI MSDC-RI MSDC-RI MSDC-RI
Column type CapillaryCapillaryCapillaryCapillaryCapillary
Active phase HG-5Ultra-1DB-1DB-1DB-1
Column length (m) 50.25.60. 60.
Carrier gas HeHe
Substrate
Column diameter (mm) 0.320.320.32 0.32
Phase thickness (μm) 0.520.25
Tstart (C) 35.80.50.50.50.
Tend (C) 250.260.230.230.230.
Heat rate (K/min) 3.3.4.4.4.
Initial hold (min) 15.
Final hold (min) 45. 10.10.10.
I 1243.1184.1186.1186.1186.
ReferenceDrumm and Spanier, 1991Okumura, 1991Binder, Benson, et al., 1990Binder, Turner, et al., 1990Binder, Turner, et al., 1990, 2
Comment MSDC-RI MSDC-RI MSDC-RI MSDC-RI MSDC-RI
Column type CapillaryCapillaryCapillaryCapillaryCapillary
Active phase DB-1DB-1DB-1SE-30OV-1
Column length (m) 50.50.60.50.183.
Carrier gas    HeN2
Substrate
Column diameter (mm) 0.320.320.320.50.762
Phase thickness (μm)
Tstart (C) 0.50.50.40.0.
Tend (C) 250.250.250.170.230.
Heat rate (K/min) 3.3.4.3.1.
Initial hold (min)   0.13.
Final hold (min)   5.
I 1183.1183.1186.1193.1196.
ReferenceHabu, Flath, et al., 1985Habu, Flath, et al., 1985Flath, Mon, et al., 1983Heydanek and McGorrin, 1981Schreyen, Dirinck, et al., 1979
Comment MSDC-RI MSDC-RI MSDC-RI MSDC-RI MSDC-RI

Normal alkane RI, polar column, temperature ramp

Data compiled by: NIST Mass Spectrometry Data Center, William E. Wallace, director

Column type CapillaryCapillaryCapillaryCapillaryCapillary
Active phase VF-Wax MSDB-WaxCP-WaxInnowaxFFAP
Column length (m) 60.30.60.30.30.
Carrier gas HeliumHeliumHelium N2
Substrate
Column diameter (mm) 0.250.320.250.250.32
Phase thickness (μm) 0.250.250.250.250.5
Tstart (C) 60.40.50.40.35.
Tend (C) 220.230.230.200.320.
Heat rate (K/min) 3.6.6.10.4.
Initial hold (min) 5.2.2.5.5.
Final hold (min) 25.20.15.15.45.
I 1962.1969.1996.1953.1984.
ReferenceDuarte, Dias, et al., 2010Chen, Song, et al., 2009Mo, Fan, et al., 2009Kaypak and Avsar, 2008Nebesny, Budryn, et al., 2007
Comment MSDC-RI MSDC-RI MSDC-RI MSDC-RI MSDC-RI
Column type CapillaryCapillaryCapillaryCapillaryCapillary
Active phase DB-WaxDB-WaxEC-1000DB-WaxDB-Wax
Column length (m) 30.30.30.30.30.
Carrier gas HeN2He
Substrate
Column diameter (mm) 0.250.320.250.530.53
Phase thickness (μm) 0.250.250.25
Tstart (C) 40.40.35.60.60.
Tend (C) 230.230.230.210.210.
Heat rate (K/min) 4.6.5.4.4.
Initial hold (min) 2.2.5.
Final hold (min) 5.15.15.
I 1942.1947.1955.1952.1953.
ReferenceXu, Fan, et al., 2007Fan and Qian, 2006Bendall, 2001Iwatsuki, Mizota, et al., 1999Iwatsuki, Mizota, et al., 1999
Comment MSDC-RI MSDC-RI MSDC-RI MSDC-RI MSDC-RI
Column type CapillaryCapillaryCapillaryCapillaryCapillary
Active phase TC-WaxDB-WaxDB-WaxDB-WaxDB-Wax
Column length (m) 60.60.60.60.60.
Carrier gas     H2
Substrate
Column diameter (mm) 0.250.320.320.320.25
Phase thickness (μm)     0.25
Tstart (C) 80.50.50.50.30.
Tend (C) 240.230.230.230.180.
Heat rate (K/min) 3.4.4.4.2.
Initial hold (min) 5.   2.
Final hold (min)  10.10.10.
I 1968.1951.1951.1951.1936.
ReferenceShuichi, Masazumi, et al., 1996Binder, Benson, et al., 1990Binder, Turner, et al., 1990Binder, Turner, et al., 1990, 2Takeoka, Flath, et al., 1988
Comment MSDC-RI MSDC-RI MSDC-RI MSDC-RI MSDC-RI
Column type CapillaryCapillaryCapillary
Active phase DB-WaxCarbowax 20MCarbowax 20M
Column length (m) 60.150.39.
Carrier gas H2HeH2
Substrate
Column diameter (mm) 0.250.640.30
Phase thickness (μm) 0.25
Tstart (C) 30.50.60.
Tend (C) 180.170.220.
Heat rate (K/min) 2.1.2.
Initial hold (min) 2.10.
Final hold (min)  60.
I 1937.1950.1912.
ReferenceTakeoka, Flath, et al., 1988Seifert and King, 1982Liardon and Ledermann, 1980
Comment MSDC-RI MSDC-RI MSDC-RI

References

Steele, Chirico, et al., 1992
Steele, W.V.; Chirico, R.D.; Knipmeyer, S.E.; Nguyen, A.,
The thermodynamic properties of benzothiazole and benzoxazole,
J. Chem. Thermodyn., 1992, 24, 449-529. [all data]
Steele, Chirico, et al., 1992, 2
Steele, W.V.; Chirico, R.D.; Knipmeyer, S.E.; Nguyen, A.,
The thermodynamic properties of benzothiazole and benzoxazole,
J. Chem. Thermodynam., 1992, 24, 499-529. [all data]
Goursot and Westrum, 1969
Goursot, P.; Westrum, E.F., Jr.,
Heat capacity and thermodynamic properties of benzothiazole from 5° to 320°K,
J. Chem. Eng. Data, 1969, 14, 1-3. [all data]
Goursot and Westrum, 1968
Goursot, P.; Westrum,
E.F., Measure de la capacite calorifique du benzothiazole de 4 a 320K, C.R. Acad. Sc. Paris,
Ser., 1968, C 266, 1267-1268. [all data]
Weast and Grasselli, 1989
CRC Handbook of Data on Organic Compounds, 2nd Editon, Weast,R.C and Grasselli, J.G., ed(s)., CRC Press, Inc., Boca Raton, FL, 1989, 1. [all data]
Buckingham and Donaghy, 1982
Buckingham, J.; Donaghy, S.M.,
Dictionary of Organic Compounds: Fifth Edition, Chapman and Hall, New York, 1982, 1. [all data]
Witschonke, 1954
Witschonke, C.R.,
Freezing point and purity data for some organic compounds,
Anal. Chem., 1954, 26, 562-4. [all data]
Goursot and Westrum, 1969, 2
Goursot, P.; Westrum, E.F.,
Heat capacity and thermodynamic properties of benzothiazole from 5 to 320 K,
J. Chem. Eng. Data, 1969, 14, 1. [all data]
Sabbah and Hevia, 1998
Sabbah, R.; Hevia, R.,
Energetique des liaisons intermoleculaires dans les molecules de benzoxazole et de benzothiazole,
Thermochim. Acta, 1998, 313, 131-136. [all data]
Domalski and Hearing, 1996
Domalski, Eugene S.; Hearing, Elizabeth D.,
Heat Capacities and Entropies of Organic Compounds in the Condensed Phase. Volume III,
J. Phys. Chem. Ref. Data, 1996, 25, 1, 1, https://doi.org/10.1063/1.555985
. [all data]
Eland, 1969
Eland, J.H.D.,
Photoelectron spectra of conjugated hydrocarbons and heteromolecules,
Intern. J. Mass Spectrom. Ion Phys., 1969, 2, 471. [all data]
Collin and Nagels, 1961
Collin, J.; Nagels, M.,
Ionization potential and molecular complex of benzothiazol with iodine,
Nature, 1961, 190, 82. [all data]
Salmona, Faure, et al., 1975
Salmona, G.; Faure, R.; Vincent, E.-J.,
Structure electronique en serie benzothiazolique: Spectres photoelectroniques et calculs C.N.D.O.,
C.R. Acad. Sci. Ser. 3:, 1975, 280, 605. [all data]