Benzo[b]thiophene
- Formula: C8H6S
- Molecular weight: 134.198
- IUPAC Standard InChIKey: FCEHBMOGCRZNNI-UHFFFAOYSA-N
- CAS Registry Number: 95-15-8
- Chemical structure:
View 3d structure (requires JavaScript / HTML 5) - Other names: Thianaphthene; Benzothiofuran; Benzothiophen; Thianaphtene; Thianaphthen; Thionaphthene; 1-Benzothiophene; 1-Thiaindene; 2,3-Benzothiophene; Benzothiophene; NSC 47196

Gas phase thermochemistry data

Data compiled as indicated in comments:
ALS - Hussein Y. Afeefy, Joel F. Liebman, and Stephen E. Stein
DRB - Donald R. Burgess, Jr.
Quantity | Value | Units | Method | Reference | Comment |
---|---|---|---|---|---|
ΔfH°gas | 166.28 ± 0.48 | kJ/mol | Cm | Sabbah, 1979 | ALS |
ΔfH°gas | 166.6 | kJ/mol | N/A | Good, 1972 | Value computed using ΔfHsolid° value of 100.9±0.9 kj/mol from Good, 1972 and ΔsubH° value of 65.7 kj/mol from Sabbah, 1979.; DRB |

Condensed phase thermochemistry data

Data compiled as indicated in comments:
ALS - Hussein Y. Afeefy, Joel F. Liebman, and Stephen E. Stein
DH - Eugene S. Domalski and Elizabeth D. Hearing
Quantity | Value | Units | Method | Reference | Comment |
---|---|---|---|---|---|
ΔfH°solid | 100.60 ± 0.45 | kJ/mol | Cm | Sabbah, 1979 | ALS |
ΔfH°solid | 100.9 ± 0.92 | kJ/mol | Ccr | Good, 1972 | ALS |
Quantity | Value | Units | Method | Reference | Comment |
ΔcH°solid | -4708.21 ± 0.79 | kJ/mol | Ccr | Good, 1972 | ALS |
Quantity | Value | Units | Method | Reference | Comment |
S°solid,1 bar | 177.11 | J/mol*K | N/A | Finke, Gross, et al., 1954 | DH |
Constant pressure heat capacity of solid
Cp,solid (J/mol*K) | Temperature (K) | Reference | Comment |
---|---|---|---|
172.14 | 295.859 | Chirico, Knipmeyer, et al., 1991 | crystaline, I phase; T = 277 to 495 K. Unsmoothed experimental datum. Cp(liq, 298.15 K, smoothed, graphical extrapolation) = 188.17 J/mol*K.; DH |
163.01 | 298.15 | Finke, Gross, et al., 1954 | T = 12 to 335 K.; DH |

Phase change data

Data compiled as indicated in comments:
BS - Robert L. Brown and Stephen E. Stein
TRC - Thermodynamics Research Center, NIST Boulder Laboratories, Chris Muzny director
AC - William E. Acree, Jr., James S. Chickos
ALS - Hussein Y. Afeefy, Joel F. Liebman, and Stephen E. Stein
DRB - Donald R. Burgess, Jr.
DH - Eugene S. Domalski and Elizabeth D. Hearing
Quantity | Value | Units | Method | Reference | Comment |
---|---|---|---|---|---|
Tboil | 494.2 | K | N/A | Weast and Grasselli, 1989 | BS |
Tboil | 494. to 495. | K | N/A | Buckingham and Donaghy, 1982 | BS |
Tboil | 494.15 | K | N/A | Cooper, Crowne, et al., 1967 | Uncertainty assigned by TRC = 0.5 K; TRC |
Tboil | 493.1 | K | N/A | Haines, Helm, et al., 1956 | Uncertainty assigned by TRC = 0.4 K; TRC |
Quantity | Value | Units | Method | Reference | Comment |
Tfus | 305. | K | N/A | Buckingham and Donaghy, 1982 | BS |
Tfus | 304.49 | K | N/A | Haines, Helm, et al., 1956 | Uncertainty assigned by TRC = 0.05 K; determined at U. S. Bureau of Mines, Barltlesville, OK; TRC |
Quantity | Value | Units | Method | Reference | Comment |
Ttriple | 304.48 | K | N/A | Chirico, Knipmeyer, et al., 1991, 2 | Uncertainty assigned by TRC = 0.02 K; TRC |
Ttriple | 304.50 | K | N/A | Finke, Gross, et al., 1954, 2 | Crystal phase 1 phase; Uncertainty assigned by TRC = 0.05 K; TRC |
Quantity | Value | Units | Method | Reference | Comment |
ΔsubH° | 65.7 ± 0.2 | kJ/mol | C | Sabbah, 1979, 2 | AC |
ΔsubH° | 65.68 ± 0.17 | kJ/mol | C | Sabbah, 1979 | ALS |
ΔsubH° | 65.7 | kJ/mol | N/A | Sabbah, 1979 | DRB |
Reduced pressure boiling point
Tboil (K) | Pressure (bar) | Reference | Comment |
---|---|---|---|
377.2 | 0.027 | Weast and Grasselli, 1989 | BS |
376. to 378. | 0.027 | Buckingham and Donaghy, 1982 | BS |
Enthalpy of vaporization
ΔvapH (kJ/mol) | Temperature (K) | Reference | Comment |
---|---|---|---|
52.1 | 364. | Dykyj, Svoboda, et al., 1999 | Based on data from 349. to 424. K.; AC |
47.9 | 439. | Dykyj, Svoboda, et al., 1999 | Based on data from 424. to 498. K.; AC |
45.0 | 513. | Dykyj, Svoboda, et al., 1999 | Based on data from 498. to 631. K.; AC |
54.3 | 320. | Chirico, Knipmeyer, et al., 1991 | Based on data from 310. to 542. K.; AC |
52.0 | 360. | Chirico, Knipmeyer, et al., 1991 | Based on data from 310. to 542. K.; AC |
49.7 | 400. | Chirico, Knipmeyer, et al., 1991 | Based on data from 310. to 542. K.; AC |
46.2 | 460. | Chirico, Knipmeyer, et al., 1991 | Based on data from 310. to 542. K.; AC |
43.8 | 500. | Chirico, Knipmeyer, et al., 1991 | Based on data from 310. to 542. K.; AC |
41.2 | 540. | Chirico, Knipmeyer, et al., 1991 | Based on data from 310. to 542. K.; AC |
53.8 | 326. | Edwards and Prausnitz, 1981 | Based on data from 306. to 346. K. See also Dykyj, Svoboda, et al., 1999.; AC |
47.2 | 425. | Wieczorek and Kobayashi, 1981 | AC |
42.8 | 505. | Wieczorek and Kobayashi, 1981 | AC |
36.1 | 605. | Wieczorek and Kobayashi, 1981 | AC |
Enthalpy of fusion
ΔfusH (kJ/mol) | Temperature (K) | Reference | Comment |
---|---|---|---|
11.827 | 304.50 | Finke, Gross, et al., 1954 | DH |
11.84 | 304.5 | Domalski and Hearing, 1996 | AC |
Entropy of fusion
ΔfusS (J/mol*K) | Temperature (K) | Reference | Comment |
---|---|---|---|
38.84 | 304.50 | Finke, Gross, et al., 1954 | DH |
Enthalpy of phase transition
ΔHtrs (kJ/mol) | Temperature (K) | Initial Phase | Final Phase | Reference | Comment |
---|---|---|---|---|---|
11.8191 | 304.48 | crystaline, I | liquid | Chirico, Knipmeyer, et al., 1991 | DH |
Entropy of phase transition
ΔStrs (J/mol*K) | Temperature (K) | Initial Phase | Final Phase | Reference | Comment |
---|---|---|---|---|---|
38.82 | 304.48 | crystaline, I | liquid | Chirico, Knipmeyer, et al., 1991 | DH |

Gas phase ion energetics data

Data evaluated as indicated in comments:
L - Sharon G. Lias
Data compiled as indicated in comments:
LLK - Sharon G. Lias, Rhoda D. Levin, and Sherif A. Kafafi
RDSH - Henry M. Rosenstock, Keith Draxl, Bruce W. Steiner, and John T. Herron
Quantity | Value | Units | Method | Reference | Comment |
---|---|---|---|---|---|
IE (evaluated) | 8.17 ± 0.03 | eV | N/A | N/A | L |
Ionization energy determinations
IE (eV) | Method | Reference | Comment |
---|---|---|---|
8.13 ± 0.015 | PE | Gusten, Klasinc, et al., 1976 | LLK |
8.73 ± 0.05 | EI | Thorstad and Undheim, 1974 | LLK |
8.20 | PE | Clark, Gleiter, et al., 1973 | LLK |
8.17 ± 0.05 | PE | Eland, 1969 | RDSH |

Normal alkane RI, non-polar column, temperature ramp

Data compiled by: NIST Mass Spectrometry Data Center, William E. Wallace, director

Column type CapillaryCapillaryCapillaryCapillaryCapillary
Active phase PONAPONAPB-1DB-5DB-1
Column length (m) 50.50.50.30.60.
Carrier gas N2 H2H2He
Substrate
Column diameter (mm) 0.200.200.320.320.25
Phase thickness (μm) 0.500.500.20.251.0
Tstart (C) 35.30.80.80.40.
Tend (C) 170.150.270.270.260.
Heat rate (K/min) 2.2.4.4.2.
Initial hold (min)   2.2.5.
Final hold (min)   5.5.60.
I 1205.1165.1169.1172.1145.
ReferenceYang, Wang, et al., 2004Yang, Wang, et al., 2003Andersson and Weis, 1994Andersson and Weis, 1994Yu, Wu, et al., 1994
Comment MSDC-RI MSDC-RI MSDC-RI MSDC-RI MSDC-RI
Column type Capillary
Active phase Ultra-1
Column length (m) 25.
Carrier gas He
Substrate
Column diameter (mm) 0.32
Phase thickness (μm) 0.25
Tstart (C) 80.
Tend (C) 260.
Heat rate (K/min) 3.
Initial hold (min)
Final hold (min)
I 1159.
ReferenceOkumura, 1991
Comment MSDC-RI

Van Den Dool and Kratz RI, non-polar column, custom temperature program

Data compiled by: NIST Mass Spectrometry Data Center, William E. Wallace, director

Column type CapillaryCapillaryCapillary
Active phase OV-1015 % Phenyl methyl siloxaneMethyl Silicone
Column length (m) 15.25.
Carrier gas HeHe
Substrate
Column diameter (mm) 0.250.31
Phase thickness (μm) 0.250.52
Program 50C(2min) => (20C/min) => 120C => (7C/min) => 310C(10min)50C(2min) => (20C/min) => 120C => (7C/min) => 310C(10min)50C (2min) => 20C/min => 160C => 5C/min => 210C => 10C/min => 300C
I 1155.1189.1165.
ReferenceYasuhara, Shiraishi, et al., 1997Yasuhara, Shiraishi, et al., 1997Oda, Ichikawa, et al., 1996
Comment MSDC-RI MSDC-RI MSDC-RI

Kovats' RI, non-polar column, custom temperature program

Data compiled by: NIST Mass Spectrometry Data Center, William E. Wallace, director

Column type Packed
Active phase SE-30
Column length (m) 1.5
Carrier gas He
Substrate Chromosorb G HP (80-100 mesh)
Column diameter (mm)
Phase thickness (μm)
Program not specified
I 1200.
ReferenceRamsey, Lee, et al., 1980
Comment MSDC-RI

Lee's RI, non-polar column, custom temperature program

Data compiled by: NIST Mass Spectrometry Data Center, William E. Wallace, director

Column type CapillaryCapillaryCapillaryCapillary
Active phase DB-5DB-5SPB-5SE-54
Column length (m) 60.30.60.
Carrier gas   He
Substrate
Column diameter (mm)  0.250.32
Phase thickness (μm)  0.250.10
Program not specifiednot specifiedA: 105 0C (2 min) 2.5 0C -> 230 0C 50 0C/min -> 305 0C (15 min) B: 95 0C (2 min) 3.8 0C/min -> 310 0C (5 min)not specified
I 201.5201.5200.51201.44
ReferenceFuentes, Font, et al., 2007Lundstedt, Haglund, et al., 2003Thuss, Popp, et al., 2000Guillen, Iglesias, et al., 1992
Comment MSDC-RI MSDC-RI MSDC-RI MSDC-RI

Van Den Dool and Kratz RI, polar column, temperature ramp

Data compiled by: NIST Mass Spectrometry Data Center, William E. Wallace, director

Column type Capillary
Active phase Supelcowax-10
Column length (m) 60.
Carrier gas He
Substrate
Column diameter (mm) 0.25
Phase thickness (μm) 0.25
Tstart (C) 40.
Tend (C) 200.
Heat rate (K/min) 2.
Initial hold (min) 5.
Final hold (min) 30.
I 1799.
ReferenceCadwallader, Tan, et al., 1995
Comment MSDC-RI

References

Sabbah, 1979
Sabbah, R.,
Thermodynamique de substances soufrees. I. Etude thermochimique du benzo-2,3 thiophene et du dibenzothiophene,
Bull. Soc. Chim. France, 1979, 9, 434-437. [all data]
Good, 1972
Good, W.D.,
Enthalpies of combustion of 18 organic sulfur compounds related to petroleum,
J. Chem. Eng. Data, 1972, 17, 158-162. [all data]
Finke, Gross, et al., 1954
Finke, H.L.; Gross, M.E.; Messerly, J.F.; Waddington, G.,
Benzothiophene: heat capacity, heat of transition, heat of fusion and entropy. An order-disorder transition,
J. Am. Chem. Soc., 1954, 76, 854-857. [all data]
Chirico, Knipmeyer, et al., 1991
Chirico, R.D.; Knipmeyer, S.E.; Nguyen, A.; Steele, W.V.,
The thermodynamic properties of benzo[b]thiophene,
J. Chem. Thermodyn., 1991, 23, 759-779. [all data]
Weast and Grasselli, 1989
CRC Handbook of Data on Organic Compounds, 2nd Editon, Weast,R.C and Grasselli, J.G., ed(s)., CRC Press, Inc., Boca Raton, FL, 1989, 1. [all data]
Buckingham and Donaghy, 1982
Buckingham, J.; Donaghy, S.M.,
Dictionary of Organic Compounds: Fifth Edition, Chapman and Hall, New York, 1982, 1. [all data]
Cooper, Crowne, et al., 1967
Cooper, A.R.; Crowne, C.W.P.; Farrell, P.G.,
Gas-Liquid Chromatographic Studies of Electron-Donor-Acceptor Systems,
Trans. Faraday Soc., 1967, 63, 447. [all data]
Haines, Helm, et al., 1956
Haines, W.E.; Helm, R.V.; Cook, G.L.; Ball, J.S.,
Purification and Properties of Organic Sulfur Compounds,
J. Phys. Chem., 1956, 60, 549-55. [all data]
Chirico, Knipmeyer, et al., 1991, 2
Chirico, R.D.; Knipmeyer, S.E.; Nguyen, A.; Steele, W.V.,
The thermodynamic properties of benzo[b]thiophene,
J. Chem. Thermodyn., 1991, 23, 759-79. [all data]
Finke, Gross, et al., 1954, 2
Finke, H.L.; Gross, M.E.; Messerly, J.F.; Waddington, G.,
Benzothiophene: heat capacity, heat of transition, heat of fusion and entropy. an order-disorder transition,
J. Am. Chem. Soc., 1954, 76, 854. [all data]
Sabbah, 1979, 2
Sabbah, R.,
Thermodynamics of sulfur compounds. I. Thermochemical study of 2,3-benzothiophene and dibenzothiophene,
Bull. Soc. Chim. Fr., 1979, 9-10, 434. [all data]
Dykyj, Svoboda, et al., 1999
Dykyj, J.; Svoboda, J.; Wilhoit, R.C.; Frenkel, M.L.; Hall, K.R.,
Vapor Pressure of Chemicals: Part A. Vapor Pressure and Antoine Constants for Hydrocarbons and Sulfur, Selenium, Tellurium and Hydrogen Containing Organic Compounds, Springer, Berlin, 1999, 373. [all data]
Edwards and Prausnitz, 1981
Edwards, D.R.; Prausnitz, J.M.,
Vapor pressures of some sulfur-containing, coal-related compounds,
J. Chem. Eng. Data, 1981, 26, 2, 121-124, https://doi.org/10.1021/je00024a005
. [all data]
Wieczorek and Kobayashi, 1981
Wieczorek, Stefan A.; Kobayashi, Riki,
Vapor-pressure measurements of 1-methylnaphthalene, 2-methylnaphthalene, and 9,10-dihydrophenanthrene at elevated temperatures,
J. Chem. Eng. Data, 1981, 26, 1, 8-11, https://doi.org/10.1021/je00023a005
. [all data]
Domalski and Hearing, 1996
Domalski, Eugene S.; Hearing, Elizabeth D.,
Heat Capacities and Entropies of Organic Compounds in the Condensed Phase. Volume III,
J. Phys. Chem. Ref. Data, 1996, 25, 1, 1, https://doi.org/10.1063/1.555985
. [all data]
Gusten, Klasinc, et al., 1976
Gusten, H.; Klasinc, L.; Ruscic, B.,
Photoelectron spectroscopy of J. Heterocycl. Chem.. Indene analogs,
Z. Naturforsch. A:, 1976, 31, 1051. [all data]
Thorstad and Undheim, 1974
Thorstad, O.; Undheim, K.,
Mass spectrometry of onium compounds. XXIV. Ionisation potential in structure analysis of pyridodiazo-oxides,
Chem. Scr., 1974, 6, 222. [all data]
Clark, Gleiter, et al., 1973
Clark, P.A.; Gleiter, R.; Heilbronner, E.,
Photoelectron spectra of planar sulfur J. Heterocycl. Chem.,
Tetrahedron, 1973, 29, 3085. [all data]
Eland, 1969
Eland, J.H.D.,
Photoelectron spectra of conjugated hydrocarbons and heteromolecules,
Intern. J. Mass Spectrom. Ion Phys., 1969, 2, 471. [all data]