1H-Benzotriazole

Gas phase ion energetics data

Data compiled as indicated in comments:
B - John E. Bartmess
LLK - Sharon G. Lias, Rhoda D. Levin, and Sherif A. Kafafi

Ionization energy determinations

IE (eV) Method Reference Comment
9.20 ± 0.05EIThorstad and Undheim, 1974LLK

De-protonation reactions

C6H4N3- + Hydrogen cation = 1H-Benzotriazole

By formula: C6H4N3- + H+ = C6H5N3

Quantity Value Units Method Reference Comment
Δr1415. ± 8.8kJ/molG+TSCatalan, Claramunt, et al., 1988gas phase; Revised: 91TAF; B
Quantity Value Units Method Reference Comment
Δr1384. ± 8.4kJ/molIMRECatalan, Claramunt, et al., 1988gas phase; Revised: 91TAF; B

Normal alkane RI, non-polar column, temperature ramp

View large format table.

Column type Active phase I Reference Comment
CapillaryOV-1011469.Zenkevich, 200525. m/0.20 mm/0.10 μm, N2/He, 6. K/min; Tstart: 50. C; Tend: 250. C

Normal alkane RI, polar column, temperature ramp

View large format table.

Column type Active phase I Reference Comment
CapillaryTC-FFAP2629.Kurose and Yatagai, 200560. m/0.25 mm/0.4 μm, He, 3. K/min, 220. C @ 30. min; Tstart: 60. C

Gas phase thermochemistry data

Data compiled by: Hussein Y. Afeefy, Joel F. Liebman, and Stephen E. Stein

Quantity Value Units Method Reference Comment
Δfgas335.5 ± 1.3kJ/molCcbJimenez, Roux, et al., 1989

References

Thorstad and Undheim, 1974
Thorstad, O.; Undheim, K., Mass spectrometry of onium compounds. XXIV. Ionisation potential in structure analysis of pyridodiazo-oxides, Chem. Scr., 1974, 6, 222. [all data]

Catalan, Claramunt, et al., 1988
Catalan, J.; Claramunt, R.M.; Elguero, J.; Menedez, M.; Anvia, F.; Quian, J.H.; Taagepera, M.; Taft, R.W., Basicity and Acidity of Azoles. The Annelation Effect in Azoles., J. Am. Chem. Soc., 1988, 110, 13, 4107, https://doi.org/10.1021/ja00221a001 . [all data]