Dispiro[5.1.5.1]tetradecane-7,14-dione
- Formula: C14H20O2
- Molecular weight: 220.3074
- IUPAC Standard InChIKey: NQCABGRZRRCWPC-UHFFFAOYSA-N
- CAS Registry Number: 950-21-0
- Chemical structure:
View 3d structure (requires JavaScript / HTML 5) - Other names: Cyclohexylketene dimer

Gas phase ion energetics data

Data compiled as indicated in comments:
LBLHLM - Sharon G. Lias, John E. Bartmess, Joel F. Liebman, John L. Holmes, Rhoda D. Levin, and W. Gary Mallard
Ionization energy determinations
IE (eV) | Method | Reference | Comment |
---|---|---|---|
9.0 ± 0.05 | EI | Olivares, Flesch, et al., 1984 | LBLHLM |
Appearance energy determinations
Ion | AE (eV) | Other Products | Method | Reference | Comment |
---|---|---|---|---|---|
C13H20O+ | 9.8 ± 0.11 | CO | EI | Olivares, Flesch, et al., 1984 | LBLHLM |

References

Olivares, Flesch, et al., 1984
Olivares, J.A.; Flesch, G.D.; Svec, H.J.,
Mass spectrometry of five ketene dimers,
Int. J. Mass Spectrom. Ion Processes, 1984, 56, 293. [all data]