Phenol, 2,2'-[1,2-ethanediylbis(nitrilomethylidyne)]bis-
- Formula: C16H16N2O2
- Molecular weight: 268.3104
- IUPAC Standard InChIKey: VEUMANXWQDHAJV-UHFFFAOYSA-N
- CAS Registry Number: 94-93-9
- Chemical structure:

Phase change data

Data compiled by: William E. Acree, Jr., James S. Chickos
Quantity | Value | Units | Method | Reference | Comment |
---|---|---|---|---|---|
ΔsubH° | 141.3 ± 3.2 | kJ/mol | ME | Ribeiro da Silva, Gonçalves, et al., 2004 | Based on data from 348. to 363. K. |
Enthalpy of fusion
ΔfusH (kJ/mol) | Temperature (K) | Method | Reference |
---|---|---|---|
34.09 | 397.9 | DSC | Ribeiro da Silva, Gonçalves, et al., 2004 |

Gas phase ion energetics data

Data compiled by: Sharon G. Lias, Rhoda D. Levin, and Sherif A. Kafafi
Ionization energy determinations
IE (eV) | Method | Reference |
---|---|---|
8.53 ± 0.07 | EI | Gilbert, Taylor, et al., 1973 |

References

Ribeiro da Silva, Gonçalves, et al., 2004
Ribeiro da Silva, Maria D.M.C.; Gonçalves, Jorge M.; Silva, Ana L.R.; Silva, Adelina M.R.O.A.; Oliveira, Paula C.F.C.; Ribeiro da Silva, Manuel A.V.,
Experimental study of the energetics of tetradentate N2O2 Schiff bases derived from salicylaldehyde,
Thermochimica Acta, 2004, 420, 1-2, 67-71, https://doi.org/10.1016/j.tca.2003.09.038
. [all data]
Gilbert, Taylor, et al., 1973
Gilbert, W.C.; Taylor, L.T.; Dillard, J.G.,
Mass spectrometric study of polydentate Schiff base coordination compounds. I. Cobalt(II), nickel(II), and copper(II) complexes of salen and oaben,
J. Am. Chem. Soc., 1973, 95, 2477. [all data]