Cyclododecanone, oxime
- Formula: C12H23NO
- Molecular weight: 197.3171
- IUPAC Standard InChIKey: SCRFXJBEIINMIC-UHFFFAOYSA-N
- CAS Registry Number: 946-89-4
- Chemical structure:
View 3d structure (requires JavaScript / HTML 5) - Permanent link for this species. Use this link for bookmarking this species for future reference.

Gas phase ion energetics data

Data compiled as indicated in comments:
LLK - Sharon G. Lias, Rhoda D. Levin, and Sherif A. Kafafi
Ionization energy determinations
IE (eV) | Method | Reference | Comment |
---|---|---|---|
8.84 ± 0.03 | PI | Golubitskii, Kulikov, et al., 1979 | LLK |
Appearance energy determinations
Ion | AE (eV) | Other Products | Method | Reference | Comment |
---|---|---|---|---|---|
C6H11NO+ | 9.34 ± 0.05 | C6H12 | PI | Golubitskii, Kulikov, et al., 1979 | LLK |
C9H16+ | 10.01 ± 0.05 | C3H7NO | PI | Golubitskii, Kulikov, et al., 1979 | LLK |
C10H19NO+ | 9.75 ± 0.05 | C2H4 | PI | Golubitskii, Kulikov, et al., 1979 | LLK |
C11H20NO+ | 9.71 ± 0.05 | CH3 | PI | Golubitskii, Kulikov, et al., 1979 | LLK |
C12H21+ | 9.33 ± 0.05 | NHOH | PI | Golubitskii, Kulikov, et al., 1979 | LLK |
C12H22N+ | 9.95 ± 0.05 | OH | PI | Golubitskii, Kulikov, et al., 1979 | LLK |

References

Golubitskii, Kulikov, et al., 1979
Golubitskii, A.E.; Kulikov, N.S.; Zyakun, A.M.; Valovoi, V.A.; Alekseev, A.M.; Volkov, V.N.,
Photoionization mass spectra of alicyclic compounds with various substituents, and their ionization energies and appearance energies,
Bull. Acad. Sci. USSR, Div. Chem. Sci., 1979, 11, 2602. [all data]