Benzene, (phenoxymethyl)-
- Formula: C13H12O
- Molecular weight: 184.2338
- IUPAC Standard InChIKey: BOTNYLSAWDQNEX-UHFFFAOYSA-N
- CAS Registry Number: 946-80-5
- Chemical structure:
View 3d structure (requires JavaScript / HTML 5) - Other names: Ether, benzyl phenyl; Anisole, α-phenyl-; Benzyl phenyl ether; Phenyl benzyl ether; α-Phenylanisole; Benzyloxybenzene; (Phenoxymethyl)-benzene; NSC 77971

Phase change data

Data compiled as indicated in comments:
BS - Robert L. Brown and Stephen E. Stein
TRC - Thermodynamics Research Center, NIST Boulder Laboratories, Chris Muzny director
AC - William E. Acree, Jr., James S. Chickos
Quantity | Value | Units | Method | Reference | Comment |
---|---|---|---|---|---|
Tboil | 559.7 | K | N/A | Weast and Grasselli, 1989 | BS |
Tboil | 559. to 560. | K | N/A | Buckingham and Donaghy, 1982 | BS |
Tboil | 558. | K | N/A | Foeldi, 1928 | Uncertainty assigned by TRC = 5. K; TRC |
Quantity | Value | Units | Method | Reference | Comment |
Tfus | 313. | K | N/A | Buckingham and Donaghy, 1982 | BS |
Tfus | 313. | K | N/A | Vowinkel, 1966 | Uncertainty assigned by TRC = 3. K; TRC |
Reduced pressure boiling point
Tboil (K) | Pressure (bar) | Reference | Comment |
---|---|---|---|
383. to 385. | 0.001 | Frinton Laboratories Inc., 1986 | BS |
397. to 398. | 0.005 | Buckingham and Donaghy, 1982 | BS |
Enthalpy of vaporization
ΔvapH (kJ/mol) | Temperature (K) | Method | Reference | Comment |
---|---|---|---|---|
58.8 | 383. | A | Stephenson and Malanowski, 1987 | Based on data from 368. to 560. K. See also Stull, 1947.; AC |
Antoine Equation Parameters
log10(P) = A − (B / (T + C))
P = vapor pressure (bar)
T = temperature (K)
View plot Requires a JavaScript / HTML 5 canvas capable browser.
Temperature (K) | A | B | C | Reference | Comment |
---|---|---|---|---|---|
368.6 to 560. | 5.01522 | 2636.002 | -34.37 | Stull, 1947 | Coefficents calculated by NIST from author's data. |

Gas phase ion energetics data

Data compiled as indicated in comments:
LLK - Sharon G. Lias, Rhoda D. Levin, and Sherif A. Kafafi
RDSH - Henry M. Rosenstock, Keith Draxl, Bruce W. Steiner, and John T. Herron
Ionization energy determinations
IE (eV) | Method | Reference | Comment |
---|---|---|---|
8.31 | CTS | Weschke, Timpe, et al., 1979 | LLK |
8.4 | EI | Ward, Cooks, et al., 1969 | RDSH |
Appearance energy determinations
Ion | AE (eV) | Other Products | Method | Reference | Comment |
---|---|---|---|---|---|
C7H7+ | 9.7 | ? | EI | Ward, Cooks, et al., 1969 | RDSH |

Van Den Dool and Kratz RI, polar column, temperature ramp

Column type | Active phase | I | Reference | Comment |
---|---|---|---|---|
Capillary | HP-Innowax | 2329. | Adamiec, Rossner, et al., 2001 | 30. m/0.25 mm/0.25 μm, N2, 5. K/min; Tstart: 60. C; Tend: 220. C |

References

Weast and Grasselli, 1989
CRC Handbook of Data on Organic Compounds, 2nd Editon, Weast,R.C and Grasselli, J.G., ed(s)., CRC Press, Inc., Boca Raton, FL, 1989, 1. [all data]
Buckingham and Donaghy, 1982
Buckingham, J.; Donaghy, S.M.,
Dictionary of Organic Compounds: Fifth Edition, Chapman and Hall, New York, 1982, 1. [all data]
Foeldi, 1928
Foeldi, Z.,
Introduction of the Benzyk Group into the Benzene Nucleus with the Aid of Sulfonic Acid Esters,
Chem. Ber., 1928, 61B, 1609-16. [all data]
Vowinkel, 1966
Vowinkel, E.,
Preparation of Aryl Alky8 Ethers by Means of O-Alkyl-N,N'-dicyclohexyl- isoureas,
Chem. Ber., 1966, 99, 1479-84. [all data]
Frinton Laboratories Inc., 1986
Frinton Laboratories Inc.,
Catalog Number 11, Frinton Laboratories Inc., Vineland, NJ, 1986, 99. [all data]
Stephenson and Malanowski, 1987
Stephenson, Richard M.; Malanowski, Stanislaw,
Handbook of the Thermodynamics of Organic Compounds, 1987, https://doi.org/10.1007/978-94-009-3173-2
. [all data]
Stull, 1947
Stull, Daniel R.,
Vapor Pressure of Pure Substances. Organic and Inorganic Compounds,
Ind. Eng. Chem., 1947, 39, 4, 517-540, https://doi.org/10.1021/ie50448a022
. [all data]
Weschke, Timpe, et al., 1979
Weschke, W.; Timpe, H.-J.; Just, G.,
Untersuchungen an EDA-Komplexen von Benzylarylethern,
J. Prakt. Chem., 1979, 321, 605. [all data]
Ward, Cooks, et al., 1969
Ward, R.S.; Cooks, R.d.; Williams, D.H.,
Substituent effects in mass spectrometry. Mass spectra of substituted phenyl benzyl ethers,
J. Am. Chem. Soc., 1969, 91, 2727. [all data]
Adamiec, Rossner, et al., 2001
Adamiec, J.; Rossner, J.; Velisek, J.; Cejpek, K.; Savel, J.,
Minor Strecker degradation products of phenylalanine and phenylglycine,
Eur. Food Res. Technol., 2001, 212, 2, 135-140, https://doi.org/10.1007/s002170000234
. [all data]