Benzaldehyde, 2-hydroxy-, oxime
- Formula: C7H7NO2
- Molecular weight: 137.1360
- IUPAC Standard InChIKey: ORIHZIZPTZTNCU-UHFFFAOYSA-N
- CAS Registry Number: 94-67-7
- Chemical structure:
View 3d structure (requires JavaScript / HTML 5) - Other names: Salicylaldehyde, oxime; o-Hydroxybenzaldehyde oxime; o-Hydroxybenzaldoxime; Saldox; Salicylaldehydoxime; Salicylaldoxime; 2-Hydroxybenzaldehyde oxime; 2-Hydroxybenzaldoxime; (2-Hydroxyphenylmethylene)azanol; NSC 5057

Condensed phase thermochemistry data

Data compiled by: Hussein Y. Afeefy, Joel F. Liebman, and Stephen E. Stein
Quantity | Value | Units | Method | Reference | Comment |
---|---|---|---|---|---|
ΔcH°solid | -3571.3 ± 0.67 | kJ/mol | Ccb | Young, Keith, et al., 1956 | Reanalyzed by Cox and Pilcher, 1970, Original value = -3573.3 ± 0.67 kJ/mol; see Dzombak, 1956 |

Phase change data

Data compiled by: William E. Acree, Jr., James S. Chickos
Quantity | Value | Units | Method | Reference | Comment |
---|---|---|---|---|---|
ΔsubH° | 105. ± 10. | kJ/mol | N/A | Burkinshaw and Mortimer, 1984 |

Van Den Dool and Kratz RI, non-polar column, temperature ramp

Column type | Active phase | I | Reference | Comment |
---|---|---|---|---|
Packed | SE-30 | 1560. | Staniewski, 1991 | GasChrom Q, 4. K/min; Column length: 2. m; Tstart: 80. C; Tend: 250. C |

References

Young, Keith, et al., 1956
Young, J.A.; Keith, J.E.; Stehle, P.; Dzombak, W.C.; Hunt, H.,
Heats of combustion of some organic nitrogen compounds,
Ind. Eng. Chem., 1956, 48, 1375-1378. [all data]
Cox and Pilcher, 1970
Cox, J.D.; Pilcher, G.,
Thermochemistry of Organic and Organometallic Compounds, Academic Press, New York, 1970, 1-636. [all data]
Dzombak, 1956
Dzombak, W.C.,
The heats of combustion of some amides and amines, Dissertation Abstr,, 1956, 22-23. [all data]
Burkinshaw and Mortimer, 1984
Burkinshaw, Philip M.; Mortimer, Colin T.,
Enthalpies of sublimation of transition metal complexes,
J. Chem. Soc., Dalton Trans., 1984, 1, 75, https://doi.org/10.1039/dt9840000075
. [all data]
Lang (editor), 1968
Lang (editor), L.,
Absorption Spectra in the Ultraviolet and Visible Region, 1968, 11, 75. [all data]
Staniewski, 1991
Staniewski, J.,
Gas chromatographic analysis of some hydroxyoxime extractants of metals,
Chem. Anal. (Warsaw), 1991, 36, 2, 325-333. [all data]