Stannane, trimethyl-1-naphthalenyl-
- Formula: C13H16Sn
- Molecular weight: 290.976
- IUPAC Standard InChIKey: GJINSWLNWKLWCH-UHFFFAOYSA-N
- CAS Registry Number: 944-85-4
- Chemical structure:
View 3d structure (requires JavaScript / HTML 5) - Permanent link for this species. Use this link for bookmarking this species for future reference.

Gas phase ion energetics data

Data compiled by: Sharon G. Lias, Rhoda D. Levin, and Sherif A. Kafafi
Ionization energy determinations
IE (eV) | Method | Reference |
---|---|---|
7.99 | CTS | Pitt, 1973 |

References

Pitt, 1973
Pitt, C.G.,
Hyperconjugation and its role in group IV chemistry,
J. Organomet. Chem., 1973, 61, 49. [all data]