1-Butanol, 3-methyl-, benzoate
- Formula: C12H16O2
- Molecular weight: 192.2542
- IUPAC Standard InChIKey: MLLAPOCBLWUFAP-UHFFFAOYSA-N
- CAS Registry Number: 94-46-2
- Chemical structure:
View 3d structure (requires JavaScript / HTML 5) - Other names: Isopentyl alcohol, benzoate; Isoamyl benzoate; Isopentyl benzoate; Benzoic acid isoamyl ester; Benzoic acid, isopentyl ester; Benzoic acid, 1-(3-methyl)butyl ester; 1-(3-Methyl)butyl benzoate; Benzoic acid, 3-methylbutyl ester; 3-Methyl-1-butyl benzoate; 3-Methylbutyl benzoate; 1-Butanol, 3-methyl-, 1-benzoate; NSC 9284

Phase change data

Data compiled as indicated in comments:
TRC - Thermodynamics Research Center, NIST Boulder Laboratories, Chris Muzny director
AC - William E. Acree, Jr., James S. Chickos
Quantity | Value | Units | Method | Reference | Comment |
---|---|---|---|---|---|
Tboil | 535.5 | K | N/A | Lecat, 1927 | Uncertainty assigned by TRC = 0.5 K; TRC |
Tboil | 535.15 | K | N/A | Kahlbaum, 1884 | Uncertainty assigned by TRC = 2. K; TRC |
Enthalpy of vaporization
ΔvapH (kJ/mol) | Temperature (K) | Method | Reference | Comment |
---|---|---|---|---|
51.6 | 360. | A | Stephenson and Malanowski, 1987 | Based on data from 345. to 535. K. See also Stull, 1947.; AC |
56.0 | 419. | A | Stephenson and Malanowski, 1987 | Based on data from 404. to 489. K.; AC |
Antoine Equation Parameters
log10(P) = A − (B / (T + C))
P = vapor pressure (bar)
T = temperature (K)
View plot Requires a JavaScript / HTML 5 canvas capable browser.
Temperature (K) | A | B | C | Reference | Comment |
---|---|---|---|---|---|
345. to 535. | 5.86093 | 3383.725 | 42.538 | Stull, 1947 | Coefficents calculated by NIST from author's data. |

Gas phase ion energetics data

Data compiled by: Sharon G. Lias, Rhoda D. Levin, and Sherif A. Kafafi
Appearance energy determinations
Ion | AE (eV) | Other Products | Method | Reference | Comment |
---|---|---|---|---|---|
C6H5+ | 15.2 ± 0.10 | ? | EI | Tajima, Azami, et al., 1977 |

Normal alkane RI, non-polar column, temperature ramp

Data compiled by: NIST Mass Spectrometry Data Center, William E. Wallace, director

Column type CapillaryCapillaryCapillaryCapillaryCapillary
Active phase SLB-5 MSHP-1Methyl SiliconeHP-5HP-5MS
Column length (m) 30.50.60.60.30.
Carrier gas HeliumHeHeHeHe
Substrate
Column diameter (mm) 0.250.20.30.320.25
Phase thickness (μm) 0.250.5 0.250.25
Tstart (C) 50.60.50.30.60.
Tend (C) 250.250.240.260.285.
Heat rate (K/min) 3.2.3.2.4.3
Initial hold (min) 2.  2.
Final hold (min) 10.120. 28.
I 1438.1409.1436.1441.81430.
ReferenceLo Presti, Sciarrone, et al., 2008Castel, Fernandez, et al., 2006Chalchat and Özcan, 2005Leffingwell and Alford, 2005Tesevic, Nikicevic, et al., 2005
Comment MSDC-RI MSDC-RI MSDC-RI MSDC-RI MSDC-RI
Column type CapillaryCapillaryCapillaryCapillaryCapillary
Active phase HP-1DB-5Ultra-1SE-30OV-1
Column length (m) 50.25.25.25.183.
Carrier gas HeHeHeN2N2
Substrate
Column diameter (mm) 0.20.20.320.220.762
Phase thickness (μm) 0.5 0.25
Tstart (C) 60.60.80.100.0.
Tend (C) 220.220.260. 230.
Heat rate (K/min) 2.3.3.6.1.
Initial hold (min)
Final hold (min) 45.
I 1415.1437.1402.1413.1414.
ReferenceFernandez, Lizzani-Cuvelier, et al., 2003Schwob, Bessière, et al., 2002Okumura, 1991Korhonen, 1986Schreyen, Dirinck, et al., 1979
Comment MSDC-RI MSDC-RI MSDC-RI MSDC-RI MSDC-RI

Kovats' RI, polar column, isothermal

Data compiled by: NIST Mass Spectrometry Data Center, William E. Wallace, director

Column type CapillaryCapillaryCapillaryCapillaryCapillary
Active phase Carbowax 20MOV-351OV-351OV-351OV-351
Column length (m)  25.25.25.25.
Carrier gas  N2N2N2N2
Substrate
Column diameter (mm)  0.220.320.320.32
Phase thickness (μm) 0.45
Temperature (C) 150.180.140.160.180.
I 1929.1911.1913.1925.1944.
ReferenceTudor, Moldovan, et al., 1999Korhonen, 1986Korhonen and Lind, 1985Korhonen and Lind, 1985Korhonen and Lind, 1985
Comment MSDC-RI MSDC-RI MSDC-RI MSDC-RI MSDC-RI

Van Den Dool and Kratz RI, non-polar column, temperature ramp

Data compiled by: NIST Mass Spectrometry Data Center, William E. Wallace, director

Column type CapillaryCapillaryCapillaryCapillaryCapillary
Active phase 5 % Phenyl methyl siloxane5 % Phenyl methyl siloxaneDB-5SPB-5DB-1
Column length (m) 30.30.30.30.60.
Carrier gas   HeHe
Substrate
Column diameter (mm) 0.250.250.250.250.32
Phase thickness (μm) 0.250.250.250.25
Tstart (C) 60.60.60.60.50.
Tend (C) 270.270.240.250.250.
Heat rate (K/min) 15.15.3.4.4.
Initial hold (min)    2.0.1
Final hold (min) 15.15. 20.
I 1455.1463.1441.1430.1411.
ReferenceZaikin, 2010Zaikin, 2009Flamini, Cioni, et al., 2007Pino, Marbot, et al., 2004Flath, Light, et al., 1990
Comment MSDC-RI MSDC-RI MSDC-RI MSDC-RI MSDC-RI
Column type CapillaryCapillaryCapillaryCapillaryPacked
Active phase SE-30SE-30SE-30SE-30SE-30
Column length (m) 25.25.25.25.
Carrier gas N2N2N2N2
Substrate     Celite
Column diameter (mm) 0.320.320.320.33
Phase thickness (μm)
Tstart (C) 100.100.100.100.75.
Tend (C) 300.300.300. 228.
Heat rate (K/min) 10.2.6.6.
Initial hold (min)
Final hold (min)
I 1424.1412.1419.1421.1425.
ReferenceKorhonen and Lind, 1985Korhonen and Lind, 1985Korhonen and Lind, 1985Korhonen, 1985van den Dool and Kratz, 1963
Comment MSDC-RI MSDC-RI MSDC-RI MSDC-RI MSDC-RI

Normal alkane RI, non-polar column, custom temperature program

Data compiled by: NIST Mass Spectrometry Data Center, William E. Wallace, director

Column type CapillaryCapillaryCapillaryCapillaryCapillary
Active phase RTX-5SqualaneSLB-5 MSCP Sil 8 CBPolydimethyl siloxane with 5 % Ph groups
Column length (m) 30. 30.30.
Carrier gas Nitrogen HeliumHe
Substrate
Column diameter (mm) 0.25 0.250.25
Phase thickness (μm) 0.25 0.250.25
Program 60 0C 95 min) 110 0C 3 0C/min -> 200 0C 5 0C/min -> 220 0C 95 min)not specifiednot specified50C(3min) => 3C/min => 100C => 2.7C/min => 140C => 2.4C/min => 180C => 6C/min => 250Cnot specified
I 1441.1429.1439.1439.1430.
ReferenceLeela, Vipin, et al., 2009Chen, 2008Lo Presti, Sciarrone, et al., 2008Meekijjaroenroj, Bessière, et al., 2007Pino, Marbot, et al., 2005
Comment MSDC-RI MSDC-RI MSDC-RI MSDC-RI MSDC-RI
Column type CapillaryCapillary
Active phase SE-30OV-1, SE-30, Methyl silicone, SP-2100, OV-101, DB-1, etc.
Column length (m)  50.
Carrier gas  Hydrogen
Substrate
Column diameter (mm)  0.32
Phase thickness (μm)
Program not specifiednot specified
I 1421.1425.
ReferenceVinogradov, 2004Waggott and Davies, 1984
Comment MSDC-RI MSDC-RI

Normal alkane RI, polar column, custom temperature program

Data compiled by: NIST Mass Spectrometry Data Center, William E. Wallace, director

Column type CapillaryCapillaryCapillaryCapillaryCapillary
Active phase Innowax FSCHP-Innowax FSCCarbowax 20MHP-Innowax FSCInnowax FSC
Column length (m) 60.60. 60.60.
Carrier gas N2He  Helium
Substrate
Column diameter (mm) 0.250.25 0.250.25
Phase thickness (μm) 0.250.25 0.250.25
Program 60C(10min) => 4C/min => 220C(10min) => 1C/min => 240C60C(10min) => 4C/min => 220C(10min) => 1C/min => 240Cnot specified60C(10min) => 4C/min => 220C(10min) => 1C/min => 240C60 0C (10 min) 4 0C/min -> 220 0C (10 min) 1 0C/min -> 240 0C
I 1930.1932.1894.1937.1937.
ReferenceIscan, Kirimer, et al., 2006Kivcak, Akay, et al., 2004Vinogradov, 2004Tabanca, Kirimer, et al., 2001Kirimer, Tabanca, et al., 1999
Comment MSDC-RI MSDC-RI MSDC-RI MSDC-RI MSDC-RI
Column type Capillary
Active phase Carbowax 400, Carbowax 20M, Carbowax 1540, Carbowax 4000, Superox 06, PEG 20M, etc.
Column length (m) 50.
Carrier gas Hydrogen
Substrate
Column diameter (mm) 0.32
Phase thickness (μm)
Program not specified
I 1921.
ReferenceWaggott and Davies, 1984
Comment MSDC-RI

References

Lecat, 1927
Lecat, M.,
New binary azeotropes: 6th list,
Ann. Soc. Sci. Bruxelles, Ser. B, 1927, 47, 63-71. [all data]
Kahlbaum, 1884
Kahlbaum, G.W.A.,
The dependence of Boiling Temperature on Air Pressure,
Ber. Dtsch. Chem. Ges., 1884, 17, 1245. [all data]
Stephenson and Malanowski, 1987
Stephenson, Richard M.; Malanowski, Stanislaw,
Handbook of the Thermodynamics of Organic Compounds, 1987, https://doi.org/10.1007/978-94-009-3173-2
. [all data]
Stull, 1947
Stull, Daniel R.,
Vapor Pressure of Pure Substances. Organic and Inorganic Compounds,
Ind. Eng. Chem., 1947, 39, 4, 517-540, https://doi.org/10.1021/ie50448a022
. [all data]
Tajima, Azami, et al., 1977
Tajima, S.; Azami, T.; Tsuchiya, T.,
An investigation of the decomposition of the common intermediate ions produced by electron impact,
Org. Mass Spectrom., 1977, 12, 24. [all data]