Ethanone, 1-[4-(1,1-dimethylethyl)phenyl]-
- Formula: C12H16O
- Molecular weight: 176.2548
- IUPAC Standard InChIKey: UYFJYGWNYQCHOB-UHFFFAOYSA-N
- CAS Registry Number: 943-27-1
- Chemical structure:
View 3d structure (requires JavaScript / HTML 5) - Other names: Acetophenone, 4'-tert-butyl-; p-tert-Butylacetophenone; 4-tert-Butylacetophenone; 4'-tert-Butylacetophenone; 4'-t-Butylacetophenone; 1-(4-Tert-butylphenyl)ethanone

Phase change data

Data compiled by: Robert L. Brown and Stephen E. Stein
Reduced pressure boiling point
Tboil (K) | Pressure (bar) | Reference |
---|---|---|
380.7 | 0.007 | Aldrich Chemical Company Inc., 1990 |

Gas phase ion energetics data

Data evaluated as indicated in comments:
HL - Edward P. Hunter and Sharon G. Lias
Data compiled as indicated in comments:
LLK - Sharon G. Lias, Rhoda D. Levin, and Sherif A. Kafafi
Quantity | Value | Units | Method | Reference | Comment |
---|---|---|---|---|---|
Proton affinity (review) | 882.5 | kJ/mol | N/A | Hunter and Lias, 1998 | HL |
Quantity | Value | Units | Method | Reference | Comment |
Gas basicity | 850.6 | kJ/mol | N/A | Hunter and Lias, 1998 | HL |
Ionization energy determinations
IE (eV) | Method | Reference | Comment |
---|---|---|---|
9.01 ± 0.05 | PE | McAlduff, 1980 | Vertical value; LLK |

References

Aldrich Chemical Company Inc., 1990
Aldrich Chemical Company Inc.,
Catalog Handbook of Fine Chemicals, Aldrich Chemical Company, Inc., Milwaukee WI, 1990, 1. [all data]
Hunter and Lias, 1998
Hunter, E.P.; Lias, S.G.,
Evaluated Gas Phase Basicities and Proton Affinities of Molecules: An Update,
J. Phys. Chem. Ref. Data, 1998, 27, 3, 413-656, https://doi.org/10.1063/1.556018
. [all data]
McAlduff, 1980
McAlduff, E.J.,
Photoelectron spectra of substituted acetophenones. Correlations with reactivity,
Can. J. Chem., 1980, 58, 622. [all data]