Ethanone, 1-(1-Naphthalenyl)-
- Formula: C12H10O
- Molecular weight: 170.2072
- IUPAC Standard InChIKey: QQLIGMASAVJVON-UHFFFAOYSA-N
- CAS Registry Number: 941-98-0
- Chemical structure:
View 3d structure (requires JavaScript / HTML 5) - Other names: 1'-Acetonaphthone; 1-Acetylnaphthalene; 1-Acetonaphthone; α-Acetonaphthone; α-Acetylnaphthalene; α-Naphthyl methyl ketone; Methyl α-naphthyl ketone; Methyl 1-naphthyl ketone; 1-(1-Naphthalenyl)ethanone; 1-Acetonaphthalene; 1-Naphthyl methyl ketone; α-Methyl naphthyl ketone; NSC 7659; 1-(Naphthalen-4-yl)ethanone

Phase change data

Data compiled as indicated in comments:
BS - Robert L. Brown and Stephen E. Stein
AC - William E. Acree, Jr., James S. Chickos
Quantity | Value | Units | Method | Reference | Comment |
---|---|---|---|---|---|
Tboil | 575.2 | K | N/A | Aldrich Chemical Company Inc., 1990 | BS |
Quantity | Value | Units | Method | Reference | Comment |
Tfus | 307. | K | N/A | Buckingham and Donaghy, 1982 | BS |
Reduced pressure boiling point
Tboil (K) | Pressure (bar) | Reference | Comment |
---|---|---|---|
427. to 430. | 0.020 | Buckingham and Donaghy, 1982 | BS |
416. to 418. | 0.008 | Buckingham and Donaghy, 1982 | BS |
Enthalpy of vaporization
ΔvapH (kJ/mol) | Temperature (K) | Method | Reference | Comment |
---|---|---|---|---|
65.4 | 403. | A | Stephenson and Malanowski, 1987 | Based on data from 388. to 569. K.; AC |

Gas phase ion energetics data

Data compiled as indicated in comments:
LLK - Sharon G. Lias, Rhoda D. Levin, and Sherif A. Kafafi
B - John E. Bartmess
Electron affinity determinations
EA (eV) | Method | Reference | Comment |
---|---|---|---|
0.598 ± 0.030 | ECD | Wentworth, Kao, et al., 1975 | 1-aectylnaphthalene; B |
Ionization energy determinations
IE (eV) | Method | Reference | Comment |
---|---|---|---|
8.23 | PE | Utsunomiya, Kobayashi, et al., 1975 | LLK |
8.23 | PE | Utsunomiya, Kobayashi, et al., 1975 | Vertical value; LLK |

Normal alkane RI, non-polar column, custom temperature program

Column type | Active phase | I | Reference | Comment |
---|---|---|---|---|
Capillary | SE-30 | 1592. | Vinogradov, 2004 | Program: not specified |

Normal alkane RI, polar column, custom temperature program

Column type | Active phase | I | Reference | Comment |
---|---|---|---|---|
Capillary | Carbowax 20M | 2471. | Vinogradov, 2004 | Program: not specified |

References

Aldrich Chemical Company Inc., 1990
Aldrich Chemical Company Inc.,
Catalog Handbook of Fine Chemicals, Aldrich Chemical Company, Inc., Milwaukee WI, 1990, 1. [all data]
Buckingham and Donaghy, 1982
Buckingham, J.; Donaghy, S.M.,
Dictionary of Organic Compounds: Fifth Edition, Chapman and Hall, New York, 1982, 1. [all data]
Stephenson and Malanowski, 1987
Stephenson, Richard M.; Malanowski, Stanislaw,
Handbook of the Thermodynamics of Organic Compounds, 1987, https://doi.org/10.1007/978-94-009-3173-2
. [all data]
Wentworth, Kao, et al., 1975
Wentworth, W.E.; Kao, L.W.; Becker, R.S.,
Electron affinities of substituted aromatic compounds,
J. Phys. Chem., 1975, 79, 1161. [all data]
Utsunomiya, Kobayashi, et al., 1975
Utsunomiya, C.; Kobayashi, T.; Nagakura, S.,
Photoelectron spectra of substituted naphthalenes,
Bull. Chem. Soc. Jpn., 1975, 48, 1852. [all data]
Bardina, et al., 1971
Bardina, A.A., et al.,
Zhur. Organ. Khim., 1971, 7, 1267. [all data]
Vinogradov, 2004
Vinogradov, B.A.,
Production, composition, properties and application of essential oils, 2004, retrieved from http://viness.narod.ru. [all data]