4,6,8-Trimethylazulene
- Formula: C13H14
- Molecular weight: 170.2503
- IUPAC Standard InChIKey: RUNBRXWUHPOTOO-UHFFFAOYSA-N
- CAS Registry Number: 941-81-1
- Chemical structure:
View 3d structure (requires JavaScript / HTML 5) - Other names: Azulene, 4,6,8-trimethyl-; 2,4,6-Trimethylbicyclo(5.3.0)deca-2,4,6,8,10-pentaene

Gas phase ion energetics data

Data compiled as indicated in comments:
LLK - Sharon G. Lias, Rhoda D. Levin, and Sherif A. Kafafi
Ionization energy determinations
IE (eV) | Method | Reference | Comment |
---|---|---|---|
7.10 | PE | Dougherty, Lewis, et al., 1980 | Vertical value; LLK |

Kovats' RI, non-polar column, isothermal

Column type | Active phase | Temperature (C) | I | Reference | Comment |
---|---|---|---|---|---|
Capillary | OV-1 | 130. | 1638. | Engewald, Wennrich, et al., 1979 | Column length: 50. m; Column diameter: 0.23 mm |

Normal alkane RI, non-polar column, temperature ramp

Column type | Active phase | I | Reference | Comment |
---|---|---|---|---|
Capillary | Ultra-1 | 1659. | Elizalde-González, Hutfliess, et al., 1996 | 50. m/0.2 mm/0.33 μm, H2, 3. K/min, 300. C @ 35. min; Tstart: 60. C |

References

Dougherty, Lewis, et al., 1980
Dougherty, D.; Lewis, J.; Nauman, R.V.; McGlynn, S.P.,
Photoelectron spectroscopy of azulenes,
J. Electron Spectrosc. Relat. Phenom., 1980, 19, 21. [all data]
Engewald, Wennrich, et al., 1979
Engewald, W.; Wennrich, L.; Ritter, E.,
Molekülstruktur und Retentionsverhalten. XII. Zur Retention von Alkylnaphthalinen Bei der Gasverteilungs- und Gas-Adsorptions-Chromatographie,
J. Chromatogr., 1979, 174, 2, 315-323, https://doi.org/10.1016/S0021-9673(00)86005-7
. [all data]
Elizalde-González, Hutfliess, et al., 1996
Elizalde-González, M.P.; Hutfliess, M.; Hedden, K.,
Retention index system, adsorption characteristics, and sructure correlations of polycyclic aromatic hydrocarbons in fuels,
J. Hi. Res. Chromatogr., 1996, 19, 6, 345-352, https://doi.org/10.1002/jhrc.1240190608
. [all data]