(E,E)-1-Phenylhexa-1,3-dien-5-yne
- Formula: C12H10
- Molecular weight: 154.2078
- IUPAC Standard InChIKey: SEQZAYGOCMKLRP-JAFPNSLJSA-N
- CAS Registry Number: 940-50-1
- Chemical structure:
View 3d structure (requires JavaScript / HTML 5) - Permanent link for this species. Use this link for bookmarking this species for future reference.

Gas phase ion energetics data

Data compiled as indicated in comments:
LLK - Sharon G. Lias, Rhoda D. Levin, and Sherif A. Kafafi
Ionization energy determinations
IE (eV) | Method | Reference | Comment |
---|---|---|---|
7.9 | EI | Koppel, Schwarz, et al., 1974 | LLK |

References

Koppel, Schwarz, et al., 1974
Koppel, C.; Schwarz, H.; Bohlmann, F.,
Elektronenstossinduzierte fragmentierung von acetylenverbindungen,
Org. Mass Spectrom., 1974, 9, 324. [all data]