1,3-Butanedione, 1-phenyl-
- Formula: C10H10O2
- Molecular weight: 162.1852
- IUPAC Standard InChIKey: CVBUKMMMRLOKQR-UHFFFAOYSA-N
- CAS Registry Number: 93-91-4
- Chemical structure:
View 3d structure (requires JavaScript / HTML 5) - Other names: α-Acetylacetophenone; Acetoacetophenone; Acetylbenzoylmethane; Benzoylacetone; 1-Benzoyl-2-propanone; 1-Phenyl-1,3-butanedione; 2-Acetylacetophenone; 2-Propanone, benzoyl-; 1-Benzoylacetone; Benzoyl-aceton; NSC 4015; 1-phenylbutane-1,3-dione

Phase change data

Data compiled as indicated in comments:
TRC - Thermodynamics Research Center, NIST Boulder Laboratories, Chris Muzny director
ALS - Hussein Y. Afeefy, Joel F. Liebman, and Stephen E. Stein
AC - William E. Acree, Jr., James S. Chickos
DRB - Donald R. Burgess, Jr.
Quantity | Value | Units | Method | Reference | Comment |
---|---|---|---|---|---|
Tboil | 533.15 | K | N/A | Sabatier and Mailhe, 1909 | Uncertainty assigned by TRC = 3. K; TRC |
Quantity | Value | Units | Method | Reference | Comment |
Tfus | 331. | K | N/A | Wolfrom and Bobbitt, 1956 | Uncertainty assigned by TRC = 3. K; TRC |
Tfus | 333.15 | K | N/A | Sabatier and Mailhe, 1909 | Uncertainty assigned by TRC = 1. K; TRC |
Quantity | Value | Units | Method | Reference | Comment |
ΔvapH° | 55.6 | kJ/mol | E | Farrar and Jones, 1964 | ALS |
Quantity | Value | Units | Method | Reference | Comment |
ΔsubH° | 91.01 ± 0.63 | kJ/mol | V | Ribeiro da Silva and Monte, 1992 | crystal phase; ALS |
ΔsubH° | 91.0 ± 0.6 | kJ/mol | ME | Ribeiro da Silva and Monte, 1992 | AC |
ΔsubH° | 83.8 | kJ/mol | N/A | Ferrao and Ribeiro Da Silva, 1981 | DRB |
Enthalpy of sublimation
ΔsubH (kJ/mol) | Temperature (K) | Method | Reference | Comment |
---|---|---|---|---|
83.7 | 289. | V | Stephenson and Malanowski, 1987 | Based on data from 278. to 300. K. See also Aihara, 1959.; AC |
83.76 ± 0.42 | 331.3 | V | Aihara, 1959, 2 | crystal phase; ALS |

Gas phase ion energetics data

Data compiled as indicated in comments:
B - John E. Bartmess
LL - Sharon G. Lias and Joel F. Liebman
Ionization energy determinations
IE (eV) | Method | Reference | Comment |
---|---|---|---|
9.10 | EI | Orlov, Rashkes, et al., 1988 | LL |
Appearance energy determinations
Ion | AE (eV) | Other Products | Method | Reference | Comment |
---|---|---|---|---|---|
C7H5O+ | 10.20 | C3H5O | EI | Orlov, Rashkes, et al., 1988 | LL |
De-protonation reactions
C10H9O2- + =
By formula: C10H9O2- + H+ = C10H10O2
Quantity | Value | Units | Method | Reference | Comment |
---|---|---|---|---|---|
ΔrH° | 1422. ± 9.6 | kJ/mol | G+TS | Cumming and Kebarle, 1978 | gas phase; B |
Quantity | Value | Units | Method | Reference | Comment |
ΔrG° | 1393. ± 8.4 | kJ/mol | IMRE | Cumming and Kebarle, 1978 | gas phase; B |

Gas phase thermochemistry data

Data compiled as indicated in comments:
ALS - Hussein Y. Afeefy, Joel F. Liebman, and Stephen E. Stein
DRB - Donald R. Burgess, Jr.
Quantity | Value | Units | Method | Reference | Comment |
---|---|---|---|---|---|
ΔfH°gas | -58.34 ± 0.69 | kcal/mol | Cm | Ribeiro da Silva and Monte, 1992 | ALS |
ΔfH°gas | -60.06 ± 0.69 | kcal/mol | Ccb | Ferrao and Ribeiro Da Silva, 1981 | ALS |
ΔfH°gas | -67.97 | kcal/mol | N/A | Farrar and Jones, 1964 | Value computed using ΔfHliquid° value of -340±4.6 kj/mol from Farrar and Jones, 1964 and ΔvapH° value of 55.6 kj/mol from missing citation.; DRB |

Condensed phase thermochemistry data

Data compiled by: Hussein Y. Afeefy, Joel F. Liebman, and Stephen E. Stein
Quantity | Value | Units | Method | Reference | Comment |
---|---|---|---|---|---|
ΔfH°liquid | -81.2 ± 1.1 | kcal/mol | Ccb | Farrar and Jones, 1964 | |
Quantity | Value | Units | Method | Reference | Comment |
ΔcH°liquid | -1200.9 ± 1.3 | kcal/mol | Ccb | Farrar and Jones, 1964 | Corresponding ΔfHºliquid = -81.20 kcal/mol (simple calculation by NIST; no Washburn corrections) |
Quantity | Value | Units | Method | Reference | Comment |
ΔfH°solid | -80.09 ± 0.67 | kcal/mol | Ccb | Ferrao and Ribeiro Da Silva, 1981 | |
Quantity | Value | Units | Method | Reference | Comment |
ΔcH°solid | -1202.0 ± 0.60 | kcal/mol | Ccb | Ferrao and Ribeiro Da Silva, 1981 | Corresponding ΔfHºsolid = -80.11 kcal/mol (simple calculation by NIST; no Washburn corrections) |

Reaction thermochemistry data

Data compiled by: John E. Bartmess
Individual Reactions
C10H9O2- + =
By formula: C10H9O2- + H+ = C10H10O2
Quantity | Value | Units | Method | Reference | Comment |
---|---|---|---|---|---|
ΔrH° | 339.9 ± 2.3 | kcal/mol | G+TS | Cumming and Kebarle, 1978 | gas phase |
Quantity | Value | Units | Method | Reference | Comment |
ΔrG° | 333.0 ± 2.0 | kcal/mol | IMRE | Cumming and Kebarle, 1978 | gas phase |

Normal alkane RI, non-polar column, temperature ramp

Data compiled by: NIST Mass Spectrometry Data Center, William E. Wallace, director

Column type Capillary
Active phase HP-101
Column length (m) 25.
Carrier gas He
Substrate
Column diameter (mm) 0.2
Phase thickness (μm) 0.2
Tstart (C) 70.
Tend (C) 200.
Heat rate (K/min) 3.
Initial hold (min) 2.
Final hold (min) 15.
I 1656.
ReferenceMastelic, Jerkovic, et al., 2006
Comment MSDC-RI

References

Sabatier and Mailhe, 1909
Sabatier, P.; Mailhe, A.,
New Applications of the General Method of Hydrogenation with Various Metals,
Ann. Chim. Phys., 1909, 16, 70. [all data]
Wolfrom and Bobbitt, 1956
Wolfrom, M.L.; Bobbitt, J.M.,
Periodate Oxidation of Cyclic 1,3-Diketones,
J. Am. Chem. Soc., 1956, 78, 2489-93. [all data]
Farrar and Jones, 1964
Farrar, D.T.; Jones, M.M.,
Heats of combustion and bond energies in some octahedral iron(III) complexes with β-diketones,
J. Phys. Chem., 1964, 68, 1717-1721. [all data]
Ribeiro da Silva and Monte, 1992
Ribeiro da Silva, M.A.V.; Monte, M.J.S.,
Vapour pressures and standard molar enthalpies of sublimation of four crystalline B-diketones,
J. Chem. Thermodyn., 1992, 24, 1219-1228. [all data]
Ferrao and Ribeiro Da Silva, 1981
Ferrao, M.L.C.C.H.; Ribeiro Da Silva, M.A.V.,
Enthalpies of combustion of four methyl-substituted heptane-3,5-diones and benzoylacetone,
J. Chem. Thermodyn., 1981, 13, 567-571. [all data]
Stephenson and Malanowski, 1987
Stephenson, Richard M.; Malanowski, Stanislaw,
Handbook of the Thermodynamics of Organic Compounds, 1987, https://doi.org/10.1007/978-94-009-3173-2
. [all data]
Aihara, 1959
Aihara, Ariyuki,
Estimation of the Energy of Hydrogen Bonds Formed in Crystals. I. Sublimation Pressures of Some Organic Molecular Crystals and the Additivity of Lattice Energy,
Bull. Chem. Soc. Jpn., 1959, 32, 11, 1242-1248, https://doi.org/10.1246/bcsj.32.1242
. [all data]
Aihara, 1959, 2
Aihara, A.,
Estimation of the energy of hydrogen bonds formed in crystals. I. Sublimation pressures of some organic molecular crystals and the additivity of lattice energy,
Bull. Chem. Soc. Jpn., 1959, 32, 1242. [all data]
Orlov, Rashkes, et al., 1988
Orlov, V.M.; Rashkes, Y.V.; Siretskaya, T.V.; Takhistov, V.V.,
Thermochemical description of tutomeric transformations in ionized 1,3-diketones,
J. Gen. Chem. USSR, 1988, 58, 374. [all data]
Cumming and Kebarle, 1978
Cumming, J.B.; Kebarle, P.,
Summary of gas phase measurements involving acids AH. Entropy changes in proton transfer reactions involving negative ions. Bond dissociation energies D(A-H) and electron affinities EA(A),
Can. J. Chem., 1978, 56, 1. [all data]