Benzoic acid, ethyl ester
- Formula: C9H10O2
- Molecular weight: 150.1745
- IUPAC Standard InChIKey: MTZQAGJQAFMTAQ-UHFFFAOYSA-N
- CAS Registry Number: 93-89-0
- Chemical structure:
View 3d structure (requires JavaScript / HTML 5) - Other names: Ethyl benzenecarboxylate; Ethyl benzoate; Benzoic ether; Essence of niobe; Ethylester kyseliny benzoove; 2-methoxy-1-phenyl-ethanone

Phase change data

Data compiled as indicated in comments:
BS - Robert L. Brown and Stephen E. Stein
TRC - Thermodynamics Research Center, NIST Boulder Laboratories, Chris Muzny director
AC - William E. Acree, Jr., James S. Chickos
Quantity | Value | Units | Method | Reference | Comment |
---|---|---|---|---|---|
Tboil | 485. ± 2. | K | AVG | N/A | Average of 10 values; Individual data points |
Quantity | Value | Units | Method | Reference | Comment |
Tfus | 239. ± 2. | K | AVG | N/A | Average of 6 values; Individual data points |
Quantity | Value | Units | Method | Reference | Comment |
ΔvapH° | 61.1 ± 0.3 | kJ/mol | GS | Vasiltsova, Verevkin, et al., 2006 | Based on data from 283. to 332. K.; AC |
Reduced pressure boiling point
Tboil (K) | Pressure (bar) | Reference | Comment |
---|---|---|---|
360.2 | 0.013 | Weast and Grasselli, 1989 | BS |
360.3 | 0.013 | Buckingham and Donaghy, 1982 | BS |
Enthalpy of vaporization
ΔvapH (kJ/mol) | Temperature (K) | Method | Reference | Comment |
---|---|---|---|---|
52.5 ± 0.2 | 380. | EB | Steele, Chirico, et al., 2002 | Based on data from 369. to 531. K.; AC |
49.6 ± 0.2 | 420. | EB | Steele, Chirico, et al., 2002 | Based on data from 369. to 531. K.; AC |
46.7 ± 0.3 | 460. | EB | Steele, Chirico, et al., 2002 | Based on data from 369. to 531. K.; AC |
43.6 ± 0.5 | 500. | EB | Steele, Chirico, et al., 2002 | Based on data from 369. to 531. K.; AC |
57.0 | 356. | BG | Katayama, 1988 | Based on data from 344. to 440. K.; AC |
50.5 | 419. | BG | Katayama, 1988 | Based on data from 344. to 440. K.; AC |
55.9 | 303. | A | Stephenson and Malanowski, 1987 | Based on data from 288. to 333. K.; AC |
50.4 | 373. | A | Stephenson and Malanowski, 1987 | Based on data from 358. to 487. K.; AC |
51.9 | 332. | N/A | Stull, 1947 | Based on data from 317. to 486. K.; AC |
Antoine Equation Parameters
log10(P) = A − (B / (T + C))
P = vapor pressure (bar)
T = temperature (K)
View plot Requires a JavaScript / HTML 5 canvas capable browser.
Temperature (K) | A | B | C | Reference | Comment |
---|---|---|---|---|---|
317. to 486.6 | 4.76503 | 2139.509 | -37.032 | Stull, 1947 | Coefficents calculated by NIST from author's data. |

Gas phase ion energetics data

Data compiled by: Sharon G. Lias, Rhoda D. Levin, and Sherif A. Kafafi
Ionization energy determinations
IE (eV) | Method | Reference | Comment |
---|---|---|---|
8.9 | PE | Meeks, Wahlborg, et al., 1981 | |
9.2 | PE | Meeks, Wahlborg, et al., 1981 | Vertical value |
Appearance energy determinations
Ion | AE (eV) | Other Products | Method | Reference | Comment |
---|---|---|---|---|---|
C6H5+ | 14.5 ± 0.03 | ? | EI | Tajima, Azami, et al., 1977 | |
C7H5O+ | 10.8 ± 0.07 | OC2H5 | EI | Tajima, Azami, et al., 1977 |

Condensed phase thermochemistry data

Data compiled by: Eugene S. Domalski and Elizabeth D. Hearing
Constant pressure heat capacity of liquid
Cp,liquid (cal/mol*K) | Temperature (K) | Reference |
---|---|---|
58.80 | 298.15 | Fuchs, 1979 |
67.59 | 290. | Kurnakov and Voskresenskaya, 1936 |
57.79 | 292.7 | Kolosovskii and Udovenko, 1934 |
57.79 | 292.7 | de Kolossowsky and Udowenko, 1933 |

Reaction thermochemistry data

Data compiled by: Michael M. Meot-Ner (Mautner) and Sharon G. Lias
Individual Reactions
By formula: C3H9Si+ + C9H10O2 = (C3H9Si+ • C9H10O2)
Quantity | Value | Units | Method | Reference | Comment |
---|---|---|---|---|---|
ΔrH° | 50.8 | kcal/mol | PHPMS | Wojtyniak and Stone, 1986 | gas phase; switching reaction,Thermochemical ladder((CH3)3Si+)H2O, Entropy change calculated or estimated |
Quantity | Value | Units | Method | Reference | Comment |
ΔrS° | 32.0 | cal/mol*K | N/A | Wojtyniak and Stone, 1986 | gas phase; switching reaction,Thermochemical ladder((CH3)3Si+)H2O, Entropy change calculated or estimated |
Free energy of reaction
ΔrG° (kcal/mol) | T (K) | Method | Reference | Comment |
---|---|---|---|---|
35.9 | 468. | PHPMS | Wojtyniak and Stone, 1986 | gas phase; switching reaction,Thermochemical ladder((CH3)3Si+)H2O, Entropy change calculated or estimated |

Ion clustering data

Data compiled by: Michael M. Meot-Ner (Mautner) and Sharon G. Lias
Clustering reactions
By formula: C3H9Si+ + C9H10O2 = (C3H9Si+ • C9H10O2)
Quantity | Value | Units | Method | Reference | Comment |
---|---|---|---|---|---|
ΔrH° | 50.8 | kcal/mol | PHPMS | Wojtyniak and Stone, 1986 | gas phase; switching reaction,Thermochemical ladder((CH3)3Si+)H2O, Entropy change calculated or estimated |
Quantity | Value | Units | Method | Reference | Comment |
ΔrS° | 32.0 | cal/mol*K | N/A | Wojtyniak and Stone, 1986 | gas phase; switching reaction,Thermochemical ladder((CH3)3Si+)H2O, Entropy change calculated or estimated |
Free energy of reaction
ΔrG° (kcal/mol) | T (K) | Method | Reference | Comment |
---|---|---|---|---|
35.9 | 468. | PHPMS | Wojtyniak and Stone, 1986 | gas phase; switching reaction,Thermochemical ladder((CH3)3Si+)H2O, Entropy change calculated or estimated |

Kovats' RI, non-polar column, isothermal

Column type | Active phase | Temperature (C) | I | Reference | Comment |
---|---|---|---|---|---|
Capillary | DB-1 | 170. | 1133.38 | Mijin and Antonovic, 2006 | 30. m/0.256 mm/0.25 μm, N2 |
Capillary | DB-5 | 170. | 1153.14 | Mijin and Antonovic, 2006 | 60. m/0.321 mm/0.25 μm, N2 |
Capillary | SE-30 | 100. | 1148.7 | Tudor, 1997 | 40. m/0.35 mm/0.35 μm |
Capillary | SE-30 | 160. | 1144. | Korhonen, 1986 | N2; Column length: 25. m; Column diameter: 0.33 mm |
Capillary | SE-30 | 180. | 1142. | Korhonen, 1986 | N2; Column length: 25. m; Column diameter: 0.33 mm |
Capillary | SE-30 | 200. | 1142. | Korhonen, 1986 | N2; Column length: 25. m; Column diameter: 0.33 mm |
Capillary | SE-30 | 140. | 1174. | Korhonen, 1986, 2 | N2; Column length: 25. m; Column diameter: 0.22 mm |
Capillary | SE-30 | 160. | 1147. | Korhonen, 1986, 2 | N2; Column length: 25. m; Column diameter: 0.22 mm |
Capillary | SE-30 | 180. | 1169. | Korhonen, 1986, 2 | N2; Column length: 25. m; Column diameter: 0.22 mm |
Capillary | SE-30 | 140. | 1166. | Korhonen and Lind, 1985 | |
Capillary | SE-30 | 160. | 1157. | Korhonen and Lind, 1985 | |
Capillary | SE-30 | 180. | 1176. | Korhonen and Lind, 1985 | |
Capillary | SE-30 | 160. | 1164. | Korhonen and Lind, 1985, 2 | N2; Column length: 25. m; Column diameter: 0.33 mm |
Capillary | SE-30 | 180. | 1176. | Korhonen and Lind, 1985, 2 | N2; Column length: 25. m; Column diameter: 0.33 mm |
Capillary | SE-30 | 200. | 1179. | Korhonen and Lind, 1985, 2 | N2; Column length: 25. m; Column diameter: 0.33 mm |
Packed | SE-30 | 180. | 1178. | Oszczapowicz, Osek, et al., 1985 | N2, Chromosorb A AW; Column length: 3. m |
Packed | SE-30 | 150. | 1160. | Tiess, 1984 | Ar, Gas Chrom Q (80-100 mesh); Column length: 3. m |
Packed | SE-30 | 200. | 1171. | Haken, Hartley, et al., 1983 | Chromosorb W AW DMCS; Column length: 3.7 m |
Packed | SE-30 | 100. | 1152. | Pías and Gascó, 1975 | Ar, Chromosorb W AW DMCS HP (80-100 mesh); Column length: 1. m |
Packed | SE-30 | 120. | 1157. | Pías and Gascó, 1975 | Ar, Chromosorb W AW DMCS HP (80-100 mesh); Column length: 1. m |
Packed | SE-30 | 140. | 1164. | Pías and Gascó, 1975 | Ar, Chromosorb W AW DMCS HP (80-100 mesh); Column length: 1. m |

Kovats' RI, non-polar column, temperature ramp

Column type | Active phase | I | Reference | Comment |
---|---|---|---|---|
Capillary | CP Sil 8 CB | 1160. | Tayoub, Schwob, et al., 2006 | 30. m/0.25 mm/0.25 μm, H2, 50. C @ 2. min, 3. K/min; Tend: 220. C |
Capillary | CP Sil 8 CB | 1160. | Tayoub, Schwob, et al., 2006, 2 | 30. m/0.25 mm/0.25 μm, H2, 50. C @ 2. min, 3. K/min; Tend: 220. C |
Capillary | DB-5 | 1171. | Lucero, Estell, et al., 2003 | 30. m/0.25 mm/0.25 μm, He, 3. K/min; Tstart: 60. C |
Capillary | DB-1 | 1143. | Takeoka, Buttery, et al., 1992 | 60. m/0.32 mm/0.25 μm, He, 30. C @ 4. min, 2. K/min; Tend: 210. C |
Capillary | DB-1 | 1143. | Takeoka, Buttery, et al., 1992 | 60. m/0.32 mm/0.25 μm, He, 30. C @ 4. min, 2. K/min; Tend: 210. C |
Capillary | BP-1 | 1154. | Bartley and Schwede, 1989 | He, 30. C @ 2. min, 2. K/min; Column length: 50. m; Column diameter: 0.23 mm; Tend: 200. C |
Capillary | OV-101 | 1149. | Morales and Duque, 1987 | He, 2. K/min; Column length: 25. m; Column diameter: 0.31 mm; Tstart: 60. C; Tend: 200. C |

Kovats' RI, non-polar column, custom temperature program

Column type | Active phase | I | Reference | Comment |
---|---|---|---|---|
Capillary | SPB-1 | 1154. | Riu-Aumatell, Castellari, et al., 2004 | 30. m/0.25 mm/0.25 μm; Program: not specified |

Kovats' RI, polar column, isothermal

Column type | Active phase | Temperature (C) | I | Reference | Comment |
---|---|---|---|---|---|
Capillary | OV-351 | 180. | 1706. | Korhonen, 1986 | N2; Column length: 25. m; Column diameter: 0.32 mm |
Capillary | OV-351 | 180. | 1693. | Korhonen, 1986, 2 | N2; Column length: 25. m; Column diameter: 0.22 mm |
Capillary | OV-351 | 200. | 1689. | Korhonen, 1986, 2 | N2; Column length: 25. m; Column diameter: 0.22 mm |
Capillary | OV-351 | 220. | 1705. | Korhonen, 1986, 2 | N2; Column length: 25. m; Column diameter: 0.22 mm |
Capillary | OV-351 | 160. | 1685. | Korhonen and Lind, 1985, 2 | N2; Column length: 25. m; Column diameter: 0.32 mm |
Capillary | OV-351 | 180. | 1709. | Korhonen and Lind, 1985, 2 | N2; Column length: 25. m; Column diameter: 0.32 mm |

Kovats' RI, polar column, temperature ramp

Column type | Active phase | I | Reference | Comment |
---|---|---|---|---|
Capillary | Supelcowax-10 | 1683. | Wong and Teng, 1994 | He, 35. C @ 5. min, 3. K/min, 200. C @ 20. min; Column length: 60. m; Column diameter: 0.25 mm |
Capillary | Carbowax 20M | 1658. | Nishimura, Yamaguchi, et al., 1989 | 2. K/min; Column length: 50. m; Column diameter: 0.22 mm; Tstart: 80. C; Tend: 200. C |
Capillary | Carbowax 20M | 1640. | Toda, Mihara, et al., 1983 | 2. K/min; Column length: 50. m; Column diameter: 0.23 mm; Tstart: 80. C; Tend: 200. C |
Capillary | Carbowax 20M | 1641. | Toda, Mihara, et al., 1983 | 2. K/min; Column length: 50. m; Column diameter: 0.23 mm; Tstart: 80. C; Tend: 200. C |
Capillary | Carbowax 20M | 1645. | Tressl, Friese, et al., 1978 | He, 2. K/min; Column length: 50. m; Column diameter: 0.28 mm; Tstart: 70. C; Tend: 190. C |

Kovats' RI, polar column, custom temperature program

Column type | Active phase | I | Reference | Comment |
---|---|---|---|---|
Capillary | Carbowax 20M | 1653. | Garruti, Franco, et al., 2001 | H2; Column length: 30. m; Column diameter: 0.25 mm; Program: 50 0C (8 min) 4 K/min -> 110 0C 16 K/min -> 200 0C |

Van Den Dool and Kratz RI, non-polar column, temperature ramp

Column type | Active phase | I | Reference | Comment |
---|---|---|---|---|
Capillary | SPB-5 | 1172. | Balbontin, Gaete-Eastman, et al., 2007 | 30. m/0.25 mm/0.25 μm, He, 50. C @ 2. min, 20. K/min, 220. C @ 2. min |
Capillary | SPB-5 | 1180. | Engel and Ratel, 2007 | 60. m/0.32 mm/1. μm, 40. C @ 2. min, 3. K/min, 230. C @ 10. min |
Capillary | HP-5 | 1171. | Quijano, Salamanca, et al., 2007 | 30. m/0.25 mm/0.25 μm, He, 50. C @ 4. min, 4. K/min, 250. C @ 10. min |
Capillary | DB-5 | 1168. | Rout, Rao, et al., 2007 | 25. m/0.25 mm/0.25 μm, He, 2. K/min, 200. C @ 60. min; Tstart: 60. C |
Capillary | HP-5 | 1173. | Flamini, Tebano, et al., 2006 | 30. m/0.25 mm/0.25 μm, N2, 60. C @ 10. min, 5. K/min; Tend: 220. C |
Capillary | HP-5MS | 1172.9 | Zhao C.X., Li, et al., 2006 | 30. m/0.25 mm/0.25 μm, He, 4. K/min; Tstart: 80. C; Tend: 300. C |
Capillary | HP-5 | 1173. | Mahattanatawee, Goodner, et al., 2005 | 30. m/0.25 mm/0.25 μm, He, 50. C @ 5. min, 4. K/min, 250. C @ 15. min |
Capillary | HP-5MS | 1170. | Pino, Mesa, et al., 2005 | 30. m/0.25 mm/0.25 μm, He, 60. C @ 2. min, 4. K/min, 250. C @ 20. min |
Capillary | RTX-5 | 1171. | Dugo, Mondello, et al., 2004 | 30. m/0.25 mm/0.25 μm, He, 45. C @ 6. min, 3. K/min, 300. C @ 10. min |
Capillary | SPB-5 | 1170. | Pino, Marbot, et al., 2004 | 30. m/0.25 mm/0.25 μm, He, 60. C @ 2. min, 4. K/min, 250. C @ 20. min |
Capillary | DB-5 | 1170. | Reis, Pansarim, et al., 2004 | 30. m/0.25 mm/0.25 μm, He, 4. K/min; Tstart: 50. C; Tend: 290. C |
Capillary | HP-1 | 1141. | Cavalli, Fernandez, et al., 2003 | 50. m/0.2 mm/0.33 μm, He, 60. C @ 5. min, 2. K/min, 250. C @ 20. min |
Capillary | Ultra-2 | 1171. | Ceva-Antunes, Bizzo, et al., 2003 | 25. m/0.25 mm/0.33 μm, H2, 40. C @ 2. min, 3. K/min, 280. C @ 10. min |
Capillary | HP-5 | 1175. | Emilio Tomei, Manganelli, et al., 2003 | 30. m/0.25 mm/0.25 μm, N2, 60. C @ 10. min, 5. K/min; Tend: 220. C |
Capillary | PE-5 | 1172. | Isidorov and Vinogorova, 2003 | He, 3. K/min; Column length: 30. m; Column diameter: 0.25 mm; Tstart: 40. C; Tend: 280. C |
Capillary | CP Sil 5 CB | 1143. | Pino, Almora, et al., 2003 | 60. m/0.32 mm/0.25 μm, He, 60. C @ 10. min, 3. K/min, 280. C @ 60. min |
Capillary | DB-1 | 1138.2 | Sun and Stremple, 2003 | 30. m/0.25 mm/0.25 μm, He, 3. K/min; Tstart: 40. C; Tend: 325. C |
Capillary | HP-5MS | 1170. | Demetzos, Angelopoulou, et al., 2002 | 30. m/0.25 mm/0.25 μm, 50. C @ 5. min, 3. K/min; Tend: 280. C |
Capillary | SPB-5 | 1170. | Pino, Marbot, et al., 2002 | 30. m/0.25 mm/0.25 μm, He, 60. C @ 2. min, 4. K/min, 250. C @ 20. min |
Capillary | CP Sil 5 CB | 1141. | Pino and Marbot, 2001 | 50. m/0.32 mm/0.4 μm, He, 60. C @ 10. min, 3. K/min, 280. C @ 60. min |
Capillary | HP-5 | 1184. | Shalit, Katzir, et al., 2001 | He, 50. C @ 1. min, 4. K/min; Column length: 30. m; Column diameter: 0.25 mm; Tend: 200. C |
Capillary | HP-5 | 1168. | Lazari, Skaltsa, et al., 2000 | 30. m/0.25 mm/0.25 μm, He, 50. C @ 5. min, 4. K/min; Tend: 280. C |
Capillary | DB-5 | 1179. | Moio, Piombino, et al., 2000 | 30. m/0.32 mm/1. μm, H2, 3. K/min; Tstart: 40. C; Tend: 210. C |
Capillary | DB-1 | 1147. | Stashenko, Prada, et al., 1996 | 60. m/0.25 mm/0.25 μm, He, 50. C @ 5. min, 3.5 K/min; Tend: 250. C |
Capillary | Methyl Silicone | 1157. | Píry, Príbela, et al., 1995 | 25. m/0.2 mm/0.3 μm, He, 2. K/min; Tstart: 40. C; Tend: 200. C |
Capillary | DB-1 | 1143. | Flath, Light, et al., 1990 | 50. C @ 0.1 min, 4. K/min; Column length: 60. m; Column diameter: 0.32 mm; Tend: 250. C |
Capillary | DB-5 | 1155. | Guichard and Souty, 1988 | H2, 30. C @ 5. min, 1.5 K/min; Column length: 0.32 m; Column diameter: 1. mm; Tend: 180. C |
Capillary | SE-30 | 1145. | Korhonen, 1986 | N2, 6. K/min; Column length: 25. m; Column diameter: 0.33 mm; Tstart: 100. C; Tend: 310. C |
Capillary | SE-30 | 1154. | Korhonen and Lind, 1985 | 10. K/min; Tstart: 100. C; Tend: 280. C |
Capillary | SE-30 | 1155. | Korhonen and Lind, 1985 | 2. K/min; Tstart: 100. C; Tend: 280. C |
Capillary | SE-30 | 1143. | Korhonen and Lind, 1985 | 6. K/min; Tstart: 100. C; Tend: 280. C |
Capillary | SE-30 | 1154. | Korhonen and Lind, 1985, 2 | N2, 10. K/min; Column length: 25. m; Column diameter: 0.33 mm; Tstart: 100. C; Tend: 320. C |
Capillary | SE-30 | 1145. | Korhonen and Lind, 1985, 2 | N2, 2. K/min; Column length: 25. m; Column diameter: 0.33 mm; Tstart: 100. C; Tend: 320. C |
Capillary | SE-30 | 1153. | Korhonen and Lind, 1985, 2 | N2, 6. K/min; Column length: 25. m; Column diameter: 0.33 mm; Tstart: 100. C; Tend: 320. C |
Capillary | OV-101 | 1154. | Wang and Sun, 1985 | 2. K/min; Column length: 50. m; Column diameter: 0.27 mm; Tstart: 110. C |
Capillary | OV-101 | 1156. | Wang and Sun, 1985 | 2. K/min; Column length: 50. m; Column diameter: 0.27 mm; Tstart: 125. C |
Capillary | OV-101 | 1155. | Wang and Sun, 1985 | 3. K/min; Column length: 50. m; Column diameter: 0.27 mm; Tstart: 80. C |
Capillary | OV-101 | 1156. | Wang and Sun, 1985 | 4. K/min; Column length: 50. m; Column diameter: 0.27 mm; Tstart: 80. C |
Capillary | OV-101 | 1153. | Wang and Sun, 1985 | 2. K/min; Column length: 50. m; Column diameter: 0.27 mm; Tstart: 95. C |

Van Den Dool and Kratz RI, non-polar column, custom temperature program

Column type | Active phase | I | Reference | Comment |
---|---|---|---|---|
Capillary | VF-5MS | 1206. | Carasek and Pawliszyn, 2006 | 30. m/0.25 mm/0.25 μm, He; Program: 40C(2min) => 5C/min => 200C (2min) => 30C/min => 260C |
Capillary | VF-5MS | 1206. | Carasek and Pawliszyn, 2006 | 30. m/0.25 mm/0.25 μm, He; Program: 40C(2min) => 5C/min => 200C (2min) => 30C/min => 260C |
Capillary | DB-5 | 1169. | Sampaio and Nogueira, 2006 | 30. m/0.25 mm/0.25 μm; Program: 40C(2min) => 4C/min => 220C => 20C/min => 280C |
Capillary | DB-5 | 1172. | Beaulieu and Grimm, 2001 | 30. m/0.25 mm/0.25 μm, He; Program: 50C (1min) => 5C/min => 100C => 10C/min => 250C (9min) |
Capillary | DB-5MS | 1160. | Boulanger and Crouzet, 2001 | 30. m/0.25 mm/0.25 μm, H2; Program: 40C (5min) => 2C/min => 200C => 5C/min => 250C (15min) |
Packed | SE-30 | 1155. | Peng, Ding, et al., 1988 | Supelcoport; Chromosorb; Column length: 3.05 m; Program: 40C(5min) => 10C/min => 200C or 250C (60min) |

Van Den Dool and Kratz RI, polar column, temperature ramp

Column type | Active phase | I | Reference | Comment |
---|---|---|---|---|
Capillary | HP-Wax | 1645. | Flamini, Tebano, et al., 2006 | 30. m/0.25 mm/0.25 μm, N2, 60. C @ 10. min, 5. K/min; Tend: 220. C |
Capillary | DB-Wax | 1644. | Osorio, Alarcon, et al., 2006 | 30. m/0.25 mm/0.25 μm, He, 50. C @ 4. min, 4. K/min, 220. C @ 20. min |
Capillary | Supelcowax-10 | 1651. | Riu-Aumatell, Lopez-Tamames, et al., 2005 | 30. m/0.25 mm/0.25 μm, He, 60. C @ 5. min, 3. K/min, 240. C @ 10. min |
Capillary | ZB-Wax | 1658. | Ledauphin, Saint-Clair, et al., 2004 | 30. m/0.25 mm/0.15 μm, He, 35. C @ 10. min, 1.8 K/min, 220. C @ 10. min |
Capillary | DB-Wax | 1644. | Varming, Andersen, et al., 2004 | 30. m/0.25 mm/0.25 μm, He, 40. C @ 10. min, 6. K/min, 240. C @ 25. min |
Capillary | HP-Wax | 1648. | Emilio Tomei, Manganelli, et al., 2003 | 30. m/0.25 mm/0.25 μm, N2, 60. C @ 10. min, 5. K/min; Tend: 220. C |
Capillary | AT-Wax | 1649. | Pino, Almora, et al., 2003 | 60. m/0.32 mm/0.25 μm, He, 65. C @ 10. min, 2. K/min, 250. C @ 60. min |
Capillary | Supelcowax-10 | 1673. | Chung, Yung, et al., 2002 | 60. m/0.25 mm/0.25 μm, He, 35. C @ 5. min, 2. K/min, 195. C @ 90. min |
Capillary | Supelcowax-10 | 1673. | Chung, Yung, et al., 2001 | 60. m/0.25 mm/0.25 μm, He, 35. C @ 5. min, 2. K/min, 195. C @ 90. min |
Capillary | CP-Wax 52CB | 1698. | Liu, Yang, et al., 2001 | H2, 2. K/min; Column length: 50. m; Column diameter: 0.32 mm; Tstart: 50. C; Tend: 200. C |
Capillary | AT-Wax | 1651. | Pino and Marbot, 2001 | 60. m/0.32 mm/0.25 μm, He, 65. C @ 10. min, 2. K/min, 250. C @ 60. min |
Capillary | Supelcowax-10 | 1675. | Chung, 2000 | 60. m/0.25 mm/0.25 μm, He, 2. K/min, 195. C @ 90. min; Tstart: 35. C |
Capillary | CP-Wax 52CB | 1653. | Jensen, Christensen, et al., 2000 | 50. m/0.25 mm/0.2 μm, He, 30. C @ 1.3 min, 2. K/min; Tend: 220. C |
Capillary | DB-Wax | 1652. | Stashenko, Prada, et al., 1996 | 60. m/0.25 mm/0.25 μm, He, 50. C @ 5. min, 2.5 K/min; Tend: 180. C |
Capillary | Carbowax 20M | 1650. | Píry, Príbela, et al., 1995 | 50. m/0.2 mm/0.2 μm, He, 30. C @ 2. min, 4. K/min, 170. C @ 20. min |
Capillary | DB-Wax | 1650. | Iwaoka, Hagi, et al., 1994 | He, 40. C @ 5. min, 2. K/min; Column length: 30. m; Column diameter: 0.25 mm; Tend: 200. C |
Capillary | Carbowax 20M | 1650. | Suárez and Duque, 1992 | 25. m/0.31 mm/0.3 μm, 2. K/min; Tstart: 50. C; Tend: 200. C |
Capillary | Carbowax 20M | 1647. | Suárez and Duque, 1991 | 2. K/min; Column length: 25. m; Column diameter: 0.31 mm; Tstart: 50. C; Tend: 200. C |
Capillary | Carbowax 20M | 1650. | Suárez and Duque, 1991 | 2. K/min; Column length: 25. m; Column diameter: 0.31 mm; Tstart: 50. C; Tend: 200. C |
Capillary | Carbowax 20M | 1651. | Chen, Kuo, et al., 1986 | He, 50. C @ 5. min, 2. K/min, 200. C @ 40. min; Column length: 50. m; Column diameter: 0.32 mm |
Capillary | OV-351 | 1655. | Korhonen, 1986 | N2, 6. K/min; Column length: 25. m; Column diameter: 0.32 mm; Tstart: 100. C; Tend: 220. C |
Capillary | OV-351 | 1654. | Korhonen, 1986, 2 | N2, 6. K/min; Column length: 25. m; Column diameter: 0.22 mm; Tstart: 100. C; Tend: 220. C |
Capillary | OV-351 | 1676. | Korhonen and Lind, 1985, 2 | N2, 10. K/min; Column length: 25. m; Column diameter: 0.32 mm; Tstart: 100. C; Tend: 230. C |
Capillary | OV-351 | 1668. | Korhonen and Lind, 1985, 2 | N2, 2. K/min; Column length: 25. m; Column diameter: 0.32 mm; Tstart: 100. C; Tend: 230. C |
Capillary | OV-351 | 1655. | Korhonen and Lind, 1985, 2 | N2, 6. K/min; Column length: 25. m; Column diameter: 0.32 mm; Tstart: 100. C; Tend: 230. C |

Van Den Dool and Kratz RI, polar column, custom temperature program

Column type | Active phase | I | Reference | Comment |
---|---|---|---|---|
Capillary | CP-Wax 52CB | 1670. | Romeo, Ziino, et al., 2007 | 60. m/0.25 mm/0.25 μm, He; Program: 45C(5min) => 10C/min => 80C => 2C/min => 240C |
Capillary | DB-Wax | 1649. | Ferrari, Lablanquie, et al., 2004 | 60. m/0.25 mm/0.25 μm, He; Program: 35C(0.7min) => 20C/min => 70C => 4C/min => 240C |
Capillary | Supelcowax-10 | 1681. | da Porto, Pizzale, et al., 2003 | 30. m/0.32 mm/0.3 μm; Program: 60C(8min) => 8C/min => 170C => 13C/min => 240C(20min) |
Capillary | DB-Wax | 1672. | Boulanger and Crouzet, 2001 | 30. m/0.25 mm/0.25 μm, H2; Program: 60C (3min) => 2C/min => 220C => 5C/min => 250C (15min) |
Capillary | DB-Wax | 1706. | Radovic, Careri, et al., 2001 | 30. m/0.25 mm/0.25 μm; Program: 30C(8min) => 4C/min => 60C => 6C/min => 160C => 20C/min => 200C(1min) |
Capillary | HP-Innowax | 1681. | Iversen, Jakobsen, et al., 1998 | 60. m/0.25 mm/0.25 μm, He; Program: 32C(1.5min) => 3C/min => 40C (10min) => 3C/min => 200C (10min) |

Normal alkane RI, non-polar column, temperature ramp

Column type | Active phase | I | Reference | Comment |
---|---|---|---|---|
Capillary | Elite-5MS | 1170. | Tava, Pecetti, et al., 2007 | 30. m/0.32 mm/0.5 μm, He, 40. C @ 5. min, 4. K/min, 280. C @ 10. min |
Capillary | DB-5 | 1187. | Xu, Fan, et al., 2007 | 30. m/0.32 mm/0.25 μm, He, 40. C @ 2. min, 4. K/min, 250. C @ 5. min |
Capillary | HP-5 | 1170. | Bertrand, Comte, et al., 2006 | 60. m/0.25 mm/0.25 μm, He, 3. K/min; Tstart: 60. C; Tend: 250. C |
Capillary | HP-1 | 1140. | Castel, Fernandez, et al., 2006 | 50. m/0.2 mm/0.33 μm, He, 60. C @ 4. min, 2. K/min, 250. C @ 30. min |
Capillary | HP-1 | 1140. | Castel, Fernandez, et al., 2006 | 50. m/0.2 mm/0.33 μm, He, 60. C @ 4. min, 2. K/min, 250. C @ 30. min |
Capillary | HP-1 | 1139. | Castel, Fernandez, et al., 2006 | 50. m/0.2 mm/0.33 μm, He, 60. C @ 4. min, 2. K/min, 250. C @ 30. min |
Capillary | HP-1 | 1145. | Castel, Fernandez, et al., 2006, 2 | 50. m/0.2 mm/0.5 μm, He, 2. K/min, 250. C @ 120. min; Tstart: 60. C |
Capillary | HP-1 | 1145. | Castel, Fernandez, et al., 2006, 2 | 50. m/0.2 mm/0.33 μm, He, 60. C @ 4. min, 2. K/min, 250. C @ 30. min |
Capillary | DB-1 | 1141. | Chen, Sheu, et al., 2006 | Nitrogen, 40. C @ 1. min, 2. K/min, 200. C @ 9. min; Column length: 60. m; Column diameter: 0.25 mm |
Capillary | DB-5 | 1175. | Fan and Qian, 2006 | 30. m/0.32 mm/1. μm, He, 40. C @ 2. min, 4. K/min, 250. C @ 15. min |
Capillary | DB-5 | 1176. | Fan and Qian, 2006, 2 | 30. m/0.32 mm/1. μm, N2, 40. C @ 2. min, 6. K/min, 230. C @ 15. min |
Capillary | DB-5 | 1177. | Rout, Naik, et al., 2006 | 30. m/0.25 mm/0.25 μm, He, 2. K/min, 200. C @ 60. min; Tstart: 60. C |
Capillary | HP-5 | 1176. | Wang, Yang, et al., 2006 | 30. m/0.25 mm/0.25 μm, He, 60. C @ 2. min, 10. K/min, 250. C @ 10. min |
Capillary | DB-5 | 1175. | Fan and Qian, 2005 | 30. m/0.32 mm/0.25 μm, N2, 40. C @ 2. min, 4. K/min, 250. C @ 5. min |
Capillary | HP-1 | 1146. | Fernandez, Lizzani-Cuvelier, et al., 2005 | 50. m/0.2 mm/0.25 μm, 60. C @ 60. min, 2. K/min; Tend: 250. C |
Capillary | HP-5 | 1171. | Figuérédo, Cabassu, et al., 2005 | 30. m/0.25 mm/0.25 μm, He, 50. C @ 5. min, 5. K/min, 300. C @ 5. min |
Capillary | HP-5 | 1170.8 | Leffingwell and Alford, 2005 | 60. m/0.32 mm/0.25 μm, He, 30. C @ 2. min, 2. K/min, 260. C @ 28. min |
Capillary | HP-5MS | 1170. | Tesevic, Nikicevic, et al., 2005 | 30. m/0.25 mm/0.25 μm, He, 4.3 K/min; Tstart: 60. C; Tend: 285. C |
Capillary | DB-5 | 1165. | Tellez, Khan, et al., 2004 | 30. m/0.25 mm/0.25 μm, He, 3. K/min; Tstart: 60. C; Tend: 240. C |
Capillary | DB-5 | 1170. | Woerdenbag, Windono, et al., 2004 | 30. m/0.249 mm/0.25 μm, He, 3. K/min; Tstart: 60. C; Tend: 300. C |
Capillary | DB-1 | 1138. | Fekam Boyom, Ngouana, et al., 2003 | 30. m/0.25 mm/0.25 μm, N2, 5. K/min; Tstart: 50. C; Tend: 200. C |
Capillary | HP-1 | 1147. | Fernandez, Lizzani-Cuvelier, et al., 2003 | 50. m/0.2 mm/0.5 μm, He, 2. K/min, 220. C @ 45. min; Tstart: 60. C |
Capillary | SPB-5 | 1176. | Ledauphin, Guichard, et al., 2003 | 30. m/0.32 mm/0.25 μm, He, 40. C @ 1. min, 5. K/min, 220. C @ 20. min |
Capillary | SPB-5 | 1170. | Pino, Marbot, et al., 2002, 2 | 30. m/0.25 mm/0.25 μm, Helium, 60. C @ 2. min, 4. K/min, 250. C @ 20. min |
Capillary | HP-5 | 1170. | Bicalho, Pereira, et al., 2000 | 30. m/0.25 mm/0.25 μm, H2, 40. C @ 10. min, 3. K/min, 280. C @ 10. min |
Capillary | BP-5 | 1179. | Lopez, Ferreira, et al., 1999 | 50. m/0.32 mm/1. μm, He, 40. C @ 5. min, 2. K/min; Tend: 190. C |
Capillary | HP-1 | 1146. | Ong, Acree, et al., 1998 | 4. K/min; Column length: 25. m; Column diameter: 0.32 mm; Tstart: 35. C; Tend: 250. C |
Capillary | HP-1 | 1150. | Boatright and Crum, 1997 | 30. m/0.25 mm/0.1 μm, He, 50. C @ 2. min, 5. K/min, 300. C @ 3. min |
Capillary | HP-1 | 1150. | Boatright and Crum, 1997 | 30. m/0.25 mm/0.1 μm, He, 50. C @ 2. min, 5. K/min, 300. C @ 3. min |
Capillary | DB-1 | 1143. | Stashenko, Torres, et al., 1995 | 60. m/0.25 mm/0.25 μm, He, 50. C @ 5. min, 3.5 K/min; Tend: 250. C |
Capillary | DB-1 | 1147. | Peppard, 1992 | 30. m/0.25 mm/1.0 μm, He, 3. K/min, 250. C @ 30. min; Tstart: 40. C |
Capillary | DB-1 | 1154. | Peppard, 1992 | 30. m/0.25 mm/1.0 μm, He, 3. K/min, 250. C @ 30. min; Tstart: 40. C |
Capillary | Ultra-1 | 1139. | Okumura, 1991 | 25. m/0.32 mm/0.25 μm, He, 3. K/min; Tstart: 80. C; Tend: 260. C |
Capillary | DB-1 | 1143. | Binder and Flath, 1989 | 50. C @ 0.1 min, 4. K/min, 250. C @ 5. min; Column length: 60. m; Column diameter: 0.32 mm |
Capillary | SE-30 | 1149. | Korhonen, 1986, 2 | N2, 6. K/min; Column length: 25. m; Column diameter: 0.22 mm; Tstart: 100. C |
Capillary | SE-30 | 1184. | Alves and Jennings, 1979 | Helium, 2. K/min; Tstart: 70. C; Tend: 170. C |
Capillary | OV-1 | 1147. | Schreyen, Dirinck, et al., 1979 | N2, 1. K/min; Column length: 183. m; Column diameter: 0.762 mm; Tstart: 0. C; Tend: 230. C |

Normal alkane RI, non-polar column, custom temperature program

Column type | Active phase | I | Reference | Comment |
---|---|---|---|---|
Capillary | CP-Sil 8 CB | 1173. | Di Giusto, Bessiere, et al., 2010 | 30. m/0.25 mm/0.25 μm, Helium; Program: Multi-rise program |
Capillary | DB-1 | 1151. | Delort and Jaquier, 2009 | 60. m/0.25 mm/0.25 μm, Helium; Program: 50 0C (5 min) 3 0C/min -> 120 0C 5 0C/min -> 250 0C (3 min) 15 0C/min -> 300 0C (20 min) |
Capillary | HP-5 MS | 1177. | Fan, Lu, et al., 2009 | 30. m/0.25 mm/0.25 μm, Helium; Program: 40 0C (3 min) 3 0C/min -> 160 0C (2 min) 8 0C/min -> 220 0C (3 min) |
Capillary | Squalane | 1174. | Chen, 2008 | Program: not specified |
Capillary | HP-5 | 1171. | Zhao, Li, et al., 2008 | 30. m/0.25 mm/0.25 μm; Program: 40 0C (2 min) 5 0C/min -> 80 0C 7 oC/min -> 160 0C 9 0C/min -> 200 0C 20 0C/min -> 280 0C (10 min) |
Capillary | HP-5 | 1175. | Zhao, Li, et al., 2008 | 30. m/0.25 mm/0.25 μm; Program: not specified |
Capillary | CP Sil 8 CB | 1172. | Meekijjaroenroj, Bessière, et al., 2007 | 30. m/0.25 mm/0.25 μm, He; Program: 50C(3min) => 3C/min => 100C => 2.7C/min => 140C => 2.4C/min => 180C => 6C/min => 250C |
Capillary | CP-Sil | 1168. | Proffit, 2007 | 30. m/0.25 mm/0.25 μm, Helium; Program: 50 0C (3 min) 3 0C/min -> 100 0C 2.7 0C/min -> 140 0C 2.4 0C/min -> 180 0C 6 0C/min -> 250 0C |
Capillary | HP-5 | 1162. | Riu-Aumatell, Lopez-Tamames, et al., 2005 | Program: not specified |
Capillary | SE-30 | 1154. | Vinogradov, 2004 | Program: not specified |
Capillary | HP-5 | 1170. | Jordán, Margaría, et al., 2003 | 30. m/0.25 mm/0.25 μm; Program: 40C(6min) => 2.5C/min => 150C => 90C/min => 250C |
Capillary | HP-5 | 1173. | Jordán, Margaría, et al., 2003 | 30. m/0.25 mm/0.25 μm; Program: 40C(6min) => 2.5C/min => 150C => 90C/min => 250C |
Capillary | CP Sil 5 CB | 1156. | Counet, Callemien, et al., 2002 | 50. m/0.32 mm/1.2 μm; Program: 36C => 20C/min => 85C => 1C/min => 145C=3C/min => 250C(30min) |
Capillary | HP-5 | 1170. | Jordán, Margaría, et al., 2002 | 30. m/0.25 mm/0.25 μm; Program: 40C (6min) => 2.5C/min => 150C => 90C/min => 250C |
Capillary | HP-5 | 1185. | Jordán, Margaría, et al., 2002 | 30. m/0.25 mm/0.25 μm; Program: 40C (6min) => 2.5C/min => 150C => 90C/min => 250C |
Capillary | HP-5MS | 1170. | Ansorena, Gimeno, et al., 2001 | 30. m/0.25 mm/0.25 μm, He; Program: 40C (10min) => 3C/min => 120C => 10C/min => 250C (5min) |
Capillary | HP-1 | 1146. | Ong, Acree, et al., 1998 | Column length: 25. m; Column diameter: 0.32 mm; Program: not specified |
Capillary | Methyl Silicone | 1151. | Zenkevich and Tsibulskaya, 1997 | Program: not specified |
Capillary | DB-1 | 1143. | Binder and Flath, 1989 | Column length: 60. m; Column diameter: 0.32 mm; Program: not specified |
Capillary | OV-101 | 1154. | Morales and Duque, 1987 | He; Column length: 25. m; Column diameter: 0.31 mm; Program: not specified |

Normal alkane RI, polar column, temperature ramp

Column type | Active phase | I | Reference | Comment |
---|---|---|---|---|
Capillary | CP-Wax | 1678. | Mo, Fan, et al., 2009 | 60. m/0.25 mm/0.25 μm, Helium, 50. C @ 2. min, 6. K/min, 230. C @ 15. min |
Capillary | DB-Wax | 1664. | Zhao, Xu, et al., 2009 | 30. m/0.25 mm/0.25 μm, Helium, 40. C @ 2. min, 3. K/min, 230. C @ 5. min |
Capillary | HP-Innowax | 1680. | Soria, Sanz, et al., 2008 | 50. m/0.20 mm/0.20 μm, Helium, 45. C @ 2. min, 4. K/min, 190. C @ 50. min |
Capillary | DB-Wax | 1640. | Xu, Fan, et al., 2007 | 30. m/0.25 mm/0.25 μm, He, 40. C @ 2. min, 4. K/min, 230. C @ 5. min |
Capillary | DB-Wax | 1653. | Cai, Lin, et al., 2006 | 60. m/0.25 mm/0.5 μm, He, 50. C @ 2. min, 3. K/min, 230. C @ 20. min |
Capillary | DB-Wax | 1640. | Fan and Qian, 2006 | 30. m/0.32 mm/0.25 μm, He, 40. C @ 2. min, 4. K/min, 230. C @ 15. min |
Capillary | DB-Wax | 1670. | Fan and Qian, 2006, 2 | 30. m/0.32 mm/0.25 μm, N2, 40. C @ 2. min, 6. K/min, 230. C @ 15. min |
Capillary | DB-Wax Etr | 1673. | Perestrelo, Fernandes, et al., 2006 | 30. m/0.25 mm/0.25 μm, He, 40. C @ 1. min, 2. K/min, 220. C @ 10. min |
Capillary | DB-Wax | 1649. | Fan and Qian, 2005 | 30. m/0.32 mm/0.25 μm, N2, 40. C @ 2. min, 4. K/min, 230. C @ 5. min |
Capillary | Carbowax 20M | 1657. | de la Fuente, Martinez-Castro, et al., 2005 | 50. m/0.25 mm/0.25 μm, Helium, 40. C @ 2. min, 4. K/min, 190. C @ 30. min |
Capillary | PEG-20M | 1663. | Narain, Almeida, et al., 2004 | 50. m/0.20 mm/0.20 μm, 40. C @ 5. min, 3. K/min, 180. C @ 30. min |
Capillary | FFAP | 1653. | Ducruet, Fournier, et al., 2001 | 30. m/0.32 mm/0.25 μm, H2, 40. C @ 5. min, 3. K/min; Tend: 240. C |
Capillary | DB-Wax | 1660. | Lee and Shibamoto, 2001 | 30. m/0.25 mm/0.25 μm, He, 3. K/min, 180. C @ 40. min; Tstart: 50. C |
Capillary | DB-Wax | 1660. | Morales, Duque, et al., 2000 | 25. m/0.25 mm/0.25 μm, He, 50. C @ 4. min, 4. K/min, 200. C @ 10. min |
Capillary | DB-Wax | 1666. | Morales, Duque, et al., 2000 | 25. m/0.25 mm/0.25 μm, He, 50. C @ 4. min, 4. K/min, 200. C @ 10. min |
Capillary | CP-Wax 52CB | 1647. | Hwan and Chou, 1999 | 50. m/0.32 mm/0.22 μm, H2, 60. C @ 4. min, 2. K/min, 190. C @ 21. min |
Capillary | Carbowax 20M | 1662. | Lopez, Ferreira, et al., 1999 | 60. m/0.32 mm/0.5 μm, He, 40. C @ 5. min, 2. K/min; Tend: 190. C |
Capillary | Carbowax 20M | 1662. | Ferreira, Ardanuy, et al., 1998 | 60. m/0.32 mm/0.5 μm, He, 40. C @ 5. min, 2. K/min; Tend: 190. C |
Capillary | Carbowax 20M | 1662. | Ferreira, Lopez, et al., 1998 | 60. m/0.32 mm/0.5 μm, He, 40. C @ 5. min, 2. K/min; Tend: 190. C |
Capillary | DB-Wax | 1650. | Werkhoff, Güntert, et al., 1998 | 60. m/0.32 mm/0.25 μm, H2, 3. K/min; Tstart: 60. C; Tend: 220. C |
Capillary | DB-Wax | 1650. | Morales, Albarracín, et al., 1996 | 30. m/0.25 mm/0.25 μm, He, 20. C @ 4. min, 4. K/min, 200. C @ 10. min |
Capillary | DB-Wax | 1647. | Morales, Albarracín, et al., 1996 | 30. m/0.25 mm/0.25 μm, He, 50. C @ 4. min, 4. K/min, 200. C @ 10. min |
Capillary | DB-Wax | 1634. | Stashenko, Torres, et al., 1995 | 60. m/0.25 mm/0.25 μm, He, 50. C @ 5. min, 2.5 K/min; Tend: 180. C |
Capillary | CP-Wax 52CB | 1643.0 | Chyau, Chen, et al., 1992 | 50. m/0.32 mm/0.22 μm, H2, 50. C @ 5. min, 2. K/min; Tend: 200. C |
Capillary | DB-Wax | 1656. | Binder and Flath, 1989 | 50. C @ 0.1 min, 4. K/min, 250. C @ 5. min; Column length: 60. m; Column diameter: 0.32 mm |
Capillary | Carbowax 20M | 1693. | Mihara, Tateba, et al., 1988 | N2, 3. K/min; Column length: 50. m; Column diameter: 0.22 mm; Tstart: 80. C; Tend: 200. C |
Capillary | Carbowax 20M | 1694. | Mihara, Tateba, et al., 1988 | N2, 3. K/min; Column length: 50. m; Column diameter: 0.22 mm; Tstart: 80. C; Tend: 200. C |
Capillary | Carbowax 20M | 1693. | Mihara, Tateba, et al., 1987 | N2, 3. K/min; Column length: 50. m; Column diameter: 0.22 mm; Tstart: 80. C; Tend: 200. C |
Capillary | Carbowax 20M | 1694. | Mihara, Tateba, et al., 1987 | N2, 3. K/min; Column length: 50. m; Column diameter: 0.22 mm; Tstart: 80. C; Tend: 200. C |
Capillary | Carbowax 20M | 1650. | Seifert and King, 1982 | He, 50. C @ 10. min, 1. K/min, 170. C @ 60. min; Column length: 150. m; Column diameter: 0.64 mm |

Normal alkane RI, polar column, custom temperature program

Column type | Active phase | I | Reference | Comment |
---|---|---|---|---|
Capillary | DB-Wax | 1658. | Zhao, Xu, et al., 2009 | 30. m/0.25 mm/0.25 μm, Helium; Program: not specified |
Capillary | HP-20M | 1647. | Chaieb, Hajlaoui, et al., 2007 | Program: not specified |
Capillary | Carbowax 20M | 1647. | Vinogradov, 2004 | Program: not specified |
Capillary | PEG-20M | 1653. | Garruti, Franco, et al., 2003 | 30. m/0.25 mm/0.25 μm; Program: 50C(8min) => 4C/min => 110C => 16C/min => 200C |
Capillary | HP-Innowax | 1681. | Piasenzotto, Gracco, et al., 2003 | 30. m/0.32 mm/0.5 μm, He; Program: 50C(4min) => 10C/min => 230C(10min) => 10C/min => 250C |
Capillary | HP Innowax FSP | 1685. | Tasdemir, Demirci, et al., 2003 | 60. m/0.25 mm/0.25 μm, He; Program: 60C(10min) => 4C/min => 220C (10min) => 1C/min => 240C |
Capillary | Innowax FSC | 1684. | Saglam, Gozler, et al., 2001 | 60. m/0.25 mm/0.25 μm, He; Program: 60C(10min) => 4C/min => 220C(10min) => 1C/min => 240C |
Capillary | DB-Wax | 1677. | Caldentey, Daria Fumi, et al., 1998 | 30. m/0.25 mm/0.25 μm, He; Program: 25C(8min) => 4C/min => 60C => 6C/min => 160C => 20C/min => 200C |
Capillary | DB-Wax | 1663. | Binder and Flath, 1989 | Column length: 60. m; Column diameter: 0.32 mm; Program: not specified |
Capillary | Polyethylene Glycol | 1645. | MacLeod and Pieris, 1981 | Program: not specified |

References

Vasiltsova, Verevkin, et al., 2006
Vasiltsova, Tatiana V.; Verevkin, Sergey P.; Bich, Eckard; Heintz, Andreas; Bogel-Lukasik, Rafal; Domanska, Urszula,
Thermodynamic Properties of Mixtures Containing Ionic Liquids. 7. Activity Coefficients of Aliphatic and Aromatic Esters and Benzylamine in 1-Methyl-3-ethylimidazolium Bis(trifluoromethylsulfonyl) Imide Using the Transpiration Method,
J. Chem. Eng. Data, 2006, 51, 1, 213-218, https://doi.org/10.1021/je050334+
. [all data]
Weast and Grasselli, 1989
CRC Handbook of Data on Organic Compounds, 2nd Editon, Weast,R.C and Grasselli, J.G., ed(s)., CRC Press, Inc., Boca Raton, FL, 1989, 1. [all data]
Buckingham and Donaghy, 1982
Buckingham, J.; Donaghy, S.M.,
Dictionary of Organic Compounds: Fifth Edition, Chapman and Hall, New York, 1982, 1. [all data]
Steele, Chirico, et al., 2002
Steele, W.V.; Chirico, R.D.; Cowell, A.B.; Knipmeyer, S.E.; Nguyen, A.,
Thermodynamic Properties and Ideal-Gas Enthalpies of Formation for Methyl Benzoate, Ethyl Benzoate, ( R )-(+)-Limonene, tert -Amyl Methyl Ether, trans -Crotonaldehyde, and Diethylene Glycol,
J. Chem. Eng. Data, 2002, 47, 4, 667-688, https://doi.org/10.1021/je0100847
. [all data]
Katayama, 1988
Katayama, Hirotake,
Vapor pressures of methyl, ethyl, n-propyl, isobutyl, and n-butyl benzoates at reduced pressures,
J. Chem. Eng. Data, 1988, 33, 2, 75-77, https://doi.org/10.1021/je00052a002
. [all data]
Stephenson and Malanowski, 1987
Stephenson, Richard M.; Malanowski, Stanislaw,
Handbook of the Thermodynamics of Organic Compounds, 1987, https://doi.org/10.1007/978-94-009-3173-2
. [all data]
Stull, 1947
Stull, Daniel R.,
Vapor Pressure of Pure Substances. Organic and Inorganic Compounds,
Ind. Eng. Chem., 1947, 39, 4, 517-540, https://doi.org/10.1021/ie50448a022
. [all data]
Meeks, Wahlborg, et al., 1981
Meeks, J.; Wahlborg, A.; McGlynn, S.P.,
Photoelectron spectroscopy of carbonyls: Benzoic acid and its derivatives,
J. Electron Spectrosc. Relat. Phenom., 1981, 22, 43. [all data]
Tajima, Azami, et al., 1977
Tajima, S.; Azami, T.; Tsuchiya, T.,
An investigation of the decomposition of the common intermediate ions produced by electron impact,
Org. Mass Spectrom., 1977, 12, 24. [all data]