Ethanone, 1-(4-ethylphenyl)-
- Formula: C10H12O
- Molecular weight: 148.2017
- IUPAC Standard InChIKey: NODGRWCMFMEGJH-UHFFFAOYSA-N
- CAS Registry Number: 937-30-4
- Chemical structure:
View 3d structure (requires JavaScript / HTML 5) - Other names: Acetophenone, 4'-ethyl-; p-Acetylethylbenzene; p-Ethylacetophenone; p-Ethylphenyl methyl ketone; 4'-Ethylacetophenone; 4-Ethylacetophenone; 1-(4-ethylphenyl)ethanone

Phase change data

Data compiled as indicated in comments:
TRC - Thermodynamics Research Center, NIST Boulder Laboratories, Chris Muzny director
BS - Robert L. Brown and Stephen E. Stein
AC - William E. Acree, Jr., James S. Chickos
Quantity | Value | Units | Method | Reference | Comment |
---|---|---|---|---|---|
Tboil | 512. | K | N/A | Allinger and Hu, 1962 | Uncertainty assigned by TRC = 2. K; TRC |
Quantity | Value | Units | Method | Reference | Comment |
Tfus | 248.9 | K | N/A | Timmermans, 1952 | Uncertainty assigned by TRC = 0.25 K; TRC |
Tfus | 252.6 | K | N/A | Birch, Dean, et al., 1949 | Uncertainty assigned by TRC = 2. K; TRC |
Reduced pressure boiling point
Tboil (K) | Pressure (atm) | Reference | Comment |
---|---|---|---|
398.2 | 0.026 | Aldrich Chemical Company Inc., 1990 | BS |
Enthalpy of vaporization
ΔvapH (kcal/mol) | Temperature (K) | Method | Reference | Comment |
---|---|---|---|---|
10.1 | 309. | A | Stephenson and Malanowski, 1987 | Based on data from 294. to 368. K.; AC |
9.51 | 368. | N/A | Khorevskaya and Byk, 1968 | Based on data from 293. to 423. K.; AC |

Van Den Dool and Kratz RI, non-polar column, temperature ramp

View large format table.

Column type Active phase I Reference Comment
CapillaryHP-51281.Singer, Flach, et al., 200430. m/0.25 mm/0.25 μm, He, 4. K/min; Tstart: 50. C; Tend: 310. C
CapillaryDB-51273.8Xu, van Stee, et al., 200330. m/0.25 mm/1. μm, He, 2.5 K/min; Tstart: 50. C; Tend: 200. C

Van Den Dool and Kratz RI, polar column, temperature ramp

View large format table.

Column type Active phase I Reference Comment
CapillaryDB-Wax1867.Shimoda, Shigematsu, et al., 199560. m/0.25 mm/0.25 μm, 2. K/min; Tstart: 50. C; Tend: 230. C
CapillaryDB-Wax1867.Shimoda, Shigematsu, et al., 1995, 260. m/0.25 mm/0.25 μm, He, 2. K/min; Tstart: 50. C; Tend: 230. C

Normal alkane RI, non-polar column, temperature ramp

View large format table.

Column type Active phase I Reference Comment
CapillaryUltra-21267.Quiroz, Fuentes-Contreras, et al., 199940. C @ 4. min, 5. K/min; Column length: 25. m; Column diameter: 0.2 mm; Tend: 300. C

Normal alkane RI, non-polar column, custom temperature program

View large format table.

Column type Active phase I Reference Comment
CapillaryPolydimethyl siloxane with 5 % Ph groups1281.Robinson, Adams, et al., 2012Program: not specified
CapillaryPolydimethyl siloxane with 5 % Ph groups1295.Robinson, Adams, et al., 2012Program: not specified
CapillarySiloxane, 5 % Ph1277.VOC BinBase, 2012Program: not specified
CapillaryPolydimethyl siloxane, 5 % phenyl1277.Skogerson, Wohlgemuth, et al., 2011Program: not specified
CapillaryDB-51274.Yusuf and Bewaji, 2011Helium; Column length: 30. m; Column diameter: 0.32 mm; Program: not specified
CapillaryHP Ultra 11228.Hernandes, Vargas-Arispuro, et al., 199925. m/0.20 mm/0.33 μm, Nitrogen; Program: 50 0C 4 0C/min -> 180 0C 10 0C/min -> 280 0C
CapillaryHP Ultra 11245.Hernandes, Vargas-Arispuro, et al., 199925. m/0.20 mm/0.33 μm, Nitrogen; Program: 50 0C 4 0C/min -> 180 0C 10 0C/min -> 280 0C

References

Allinger and Hu, 1962
Allinger, N.L.; Hu, S.,
Conformational Analysis XXI. The Ethyl Group,
J. Am. Chem. Soc., 1962, 84, 370-2. [all data]
Timmermans, 1952
Timmermans, J.,
Freezing points of organic compounds. VVI New determinations.,
Bull. Soc. Chim. Belg., 1952, 61, 393. [all data]
Birch, Dean, et al., 1949
Birch, S.F.; Dean, R.A.; Fidler, F.A.; Lowry, R.A.,
The preparation of the c(10) monocyclic aromatic hydrocarbons,
J. Am. Chem. Soc., 1949, 71, 1362. [all data]
Aldrich Chemical Company Inc., 1990
Aldrich Chemical Company Inc.,
Catalog Handbook of Fine Chemicals, Aldrich Chemical Company, Inc., Milwaukee WI, 1990, 1. [all data]
Stephenson and Malanowski, 1987
Stephenson, Richard M.; Malanowski, Stanislaw,
Handbook of the Thermodynamics of Organic Compounds, 1987, https://doi.org/10.1007/978-94-009-3173-2
. [all data]
Khorevskaya and Byk, 1968
Khorevskaya, A.S.; Byk, S.Sh.,
Zh. Prikl. Khim. (Leningrad), 1968, 41, 11, 2566. [all data]