Cyclobutanol, 1-phenyl-
- Formula: C10H12O
- Molecular weight: 148.2017
- IUPAC Standard InChIKey: LHXASHUXCRQHPZ-UHFFFAOYSA-N
- CAS Registry Number: 935-64-8
- Chemical structure:
View 3d structure (requires JavaScript / HTML 5) - Other names: Benzene,cyclobut-1-yl-1-ol-

Phase change data

Data compiled by: Thermodynamics Research Center, NIST Boulder Laboratories, Chris Muzny director
Quantity | Value | Units | Method | Reference | Comment |
---|---|---|---|---|---|
Tfus | 312.6 | K | N/A | Hahn, Corbin, et al., 1968 | Uncertainty assigned by TRC = 1. K |

Gas phase ion energetics data

Data compiled by: Sharon G. Lias, Rhoda D. Levin, and Sherif A. Kafafi
Ionization energy determinations
IE (eV) | Method | Reference |
---|---|---|
8.0 | EI | Mikaya, Zaikin, et al., 1979 |
Appearance energy determinations
Ion | AE (eV) | Other Products | Method | Reference | Comment |
---|---|---|---|---|---|
C8H8O+ | 8.8 | C2H4 | EI | Mikaya, Zaikin, et al., 1979 |

References

Hahn, Corbin, et al., 1968
Hahn, R.C.; Corbin, T.F.; Shechter, H.,
Electrical Effects of Cycloalkyl Groups,
J. Am. Chem. Soc., 1968, 90, 3404-15. [all data]
Mikaya, Zaikin, et al., 1979
Mikaya, A.I.; Zaikin, V.G.; Finkel'stein, E.S.; Vdovin, V.M.,
Mass-spectrometric investigation of aromatic derivatives of cycloalkanes and cycloalkanols,
Izv. Akad. Nauk SSSR, Ser. Khim., 1979, 10, 2221. [all data]