Adamantane, 1-chloro-
- Formula: C10H15Cl
- Molecular weight: 170.679
- IUPAC Standard InChIKey: OZNXTQSXSHODFR-UHFFFAOYSA-N
- CAS Registry Number: 935-56-8
- Chemical structure:
View 3d structure (requires JavaScript / HTML 5) - Other names: Tricyclo[3.3.1.13,7]decane, 1-chloro-; 1-Chloroadamantane; Adamantyl chloride; 1-Adamantyl chloride; 3-Chloroadamantane; 1-chlorotricyclo[3.3.1.13,7]decane

Gas phase ion energetics data

Data compiled as indicated in comments:
LLK - Sharon G. Lias, Rhoda D. Levin, and Sherif A. Kafafi
Ionization energy determinations
IE (eV) | Method | Reference | Comment |
---|---|---|---|
9.30 | PE | Worley, Mateescu, et al., 1973 | LLK |

References

Worley, Mateescu, et al., 1973
Worley, S.D.; Mateescu, G.D.; McFarland, C.W.; Fort, R.C., Jr.; Sheley, C.F.,
Photoelectron spectra and MINDO-SCF-MO calculations for adamantane and some of its derivatives,
J. Am. Chem. Soc., 1973, 95, 7580. [all data]