1,4-Diethynylbenzene
- Formula: C10H6
- Molecular weight: 126.1546
- IUPAC Standard InChIKey: MVLGANVFCMOJHR-UHFFFAOYSA-N
- CAS Registry Number: 935-14-8
- Chemical structure:
View 3d structure (requires JavaScript / HTML 5) - Other names: Benzene,1,4-diethynyl-; 1,4-Bis(ethynyl)benzene

Gas phase ion energetics data

Data compiled as indicated in comments:
LLK - Sharon G. Lias, Rhoda D. Levin, and Sherif A. Kafafi
Ionization energy determinations
IE (eV) | Method | Reference | Comment |
---|---|---|---|
8.58 ± 0.02 | PE | Brogli, Heilbronner, et al., 1975 | LLK |

References

Brogli, Heilbronner, et al., 1975
Brogli, F.; Heilbronner, E.; Wirz, J.; Kloster-Jensen, E.; Bergman, R.G.; Vollhardt, K.P.C.; Ashe, A.J., III,
The consequences of σ and π conjugative interactions in mono-, di- and triacetylenes. A photoelectron spectroscopic investigation,
Helv. Chim. Acta, 1975, 58, 2620. [all data]