Benzene, 2-butenyl-, trans
- Formula: C10H12
- Molecular weight: 132.2023
- IUPAC Standard InChIKey: VUKHQPGJNTXTPY-NSCUHMNNSA-N
- CAS Registry Number: 935-00-2
- Chemical structure:
View 3d structure (requires JavaScript / HTML 5) - Stereoisomers:
- Other names: (E)-1-Phenyl-2-butene

Gas phase ion energetics data

Data compiled as indicated in comments:
LBLHLM - Sharon G. Lias, John E. Bartmess, Joel F. Liebman, John L. Holmes, Rhoda D. Levin, and W. Gary Mallard
LLK - Sharon G. Lias, Rhoda D. Levin, and Sherif A. Kafafi
Ionization energy determinations
IE (eV) | Method | Reference | Comment |
---|---|---|---|
8.48 | EI | Dass and Gross, 1985 | LBLHLM |
8.48 | PE | Fu and Dunbar, 1978 | LLK |
8.85 | PE | Fu and Dunbar, 1978 | Vertical value; LLK |

Kovats' RI, non-polar column, isothermal

Column type | Active phase | Temperature (C) | I | Reference | Comment |
---|---|---|---|---|---|
Capillary | OV-101 | 100. | 1059. | Engewald, Topalova, et al., 1987 | Column length: 50. m; Column diameter: 0.30 mm |

References

Dass and Gross, 1985
Dass, C.; Gross, M.L.,
The question of cyclic versus acyclic ions: The structure of [C6H10]+ gas phase ions,
Org. Mass Spectrom., 1985, 20, 34. [all data]
Fu and Dunbar, 1978
Fu, E.W.; Dunbar, R.C.,
Photodissociation spectroscopy and structural rearrangements in ions of cyclooctatetraene, styrene and related molecules,
J. Am. Chem. Soc., 1978, 100, 2283. [all data]