Methyl 4-methylphenylsulfoxide
- Formula: C8H10OS
- Molecular weight: 154.229
- IUPAC Standard InChIKey: FEVALTJSQBFLEU-UHFFFAOYSA-N
- CAS Registry Number: 934-72-5
- Chemical structure:
View 3d structure (requires JavaScript / HTML 5) - Other names: Methyl p-methylphenylsulfoxide; 1-Methanesulfinyl-4-methylbenzene

Reaction thermochemistry data

Data compiled by: John E. Bartmess
Individual Reactions
C8H9OS- + =
By formula: C8H9OS- + H+ = C8H10OS
Quantity | Value | Units | Method | Reference | Comment |
---|---|---|---|---|---|
ΔrH° | 1531. ± 8.8 | kJ/mol | G+TS | Taft and Topsom, 1987 | gas phase; value altered from reference due to change in acidity scale |
Quantity | Value | Units | Method | Reference | Comment |
ΔrG° | 1503. ± 8.4 | kJ/mol | IMRE | Taft and Topsom, 1987 | gas phase; value altered from reference due to change in acidity scale |

Gas phase ion energetics data

Data compiled as indicated in comments:
B - John E. Bartmess
LLK - Sharon G. Lias, Rhoda D. Levin, and Sherif A. Kafafi
Ionization energy determinations
IE (eV) | Method | Reference | Comment |
---|---|---|---|
8.70 | PE | Mohraz, Jian-qi, et al., 1981 | Vertical value; LLK |
De-protonation reactions
C8H9OS- + =
By formula: C8H9OS- + H+ = C8H10OS
Quantity | Value | Units | Method | Reference | Comment |
---|---|---|---|---|---|
ΔrH° | 1531. ± 8.8 | kJ/mol | G+TS | Taft and Topsom, 1987 | gas phase; value altered from reference due to change in acidity scale; B |
Quantity | Value | Units | Method | Reference | Comment |
ΔrG° | 1503. ± 8.4 | kJ/mol | IMRE | Taft and Topsom, 1987 | gas phase; value altered from reference due to change in acidity scale; B |

References

Taft and Topsom, 1987
Taft, R.W.; Topsom, R.D.,
The Nature and Analysis of Substituent Effects,
Prog. Phys. Org. Chem., 1987, 16, 1. [all data]
Mohraz, Jian-qi, et al., 1981
Mohraz, M.; Jian-qi, W.; Heilbronner, E.; Solladie-Cavallo, A.; Matloubi-Moghadam, F.,
11. Some comments on the conformations of methyl phenyl sulfides, sulfoxides and sulfones,
Helv. Chim. Acta, 1981, 64, 97. [all data]