Stannane, trimethylphenyl-
- Formula: C9H14Sn
- Molecular weight: 240.917
- IUPAC Standard InChIKey: COHOGNZHAUOXPA-UHFFFAOYSA-N
- CAS Registry Number: 934-56-5
- Chemical structure:
View 3d structure (requires JavaScript / HTML 5) - Other names: Phenyltrimethyltin; Phenyltrimethylstannane; Trimethylphenylstannane; Trimethylphenyltin; Trimethylmonophenyltin; Trimethylstannylbenzene; Tin, trimethylphenyl-

Gas phase thermochemistry data

Data compiled by: José A. Martinho Simões
Quantity | Value | Units | Method | Reference | Comment |
---|---|---|---|---|---|
ΔfH°gas | 113.5 ± 6.9 | kJ/mol | Review | Martinho Simões | The enthalpy of formation relies on -185.5 ± 3.7 kJ/mol for the enthalpy of formation of Sn(Me)3(Br)(l). |

Condensed phase thermochemistry data

Data compiled by: José A. Martinho Simões
Quantity | Value | Units | Method | Reference | Comment |
---|---|---|---|---|---|
ΔfH°liquid | 61.2 ± 5.5 | kJ/mol | Review | Martinho Simões | The enthalpy of formation relies on -185.5 ± 3.7 kJ/mol for the enthalpy of formation of Sn(Me)3(Br)(l). |

Phase change data

Data compiled by: José A. Martinho Simões
Quantity | Value | Units | Method | Reference | Comment |
---|---|---|---|---|---|
ΔvapH° | 52.3 ± 4.2 | kJ/mol | RSC | Davies, Pope, et al., 1963 |

Gas phase ion energetics data

Data compiled as indicated in comments:
LLK - Sharon G. Lias, Rhoda D. Levin, and Sherif A. Kafafi
Ionization energy determinations
IE (eV) | Method | Reference | Comment |
---|---|---|---|
8.83 ± 0.05 | PE | Distefano, Pignataro, et al., 1974 | LLK |
~8.75 | CTS | Pitt, 1973 | LLK |
8.94 | PE | Bischof, Dewar, et al., 1974 | Vertical value; LLK |

Kovats' RI, non-polar column, isothermal

Column type | Active phase | Temperature (C) | I | Reference | Comment |
---|---|---|---|---|---|
Packed | Apiezon L | 190. | 1172. | Putnam and Pu, 1965 | Celite; Column length: 1. m |

Van Den Dool and Kratz RI, non-polar column, temperature ramp

Column type | Active phase | I | Reference | Comment |
---|---|---|---|---|
Packed | Apiezon L | 1174. | Putnam and Pu, 1965, 2 | Celite, 10. K/min; Column length: 3. m; Tstart: 60. C |
Packed | Apiezon L | 1171. | Putnam and Pu, 1965, 2 | Celite, 15. K/min; Column length: 3. m; Tstart: 60. C |
Packed | Apiezon L | 1169. | Putnam and Pu, 1965, 2 | Celite, 6. K/min; Column length: 3. m; Tstart: 60. C |

References

Martinho Simões
Martinho Simões, J.A.,
Private communication (see http://webbook.nist.gov/chemistry/om/). [all data]
Davies, Pope, et al., 1963
Davies, J.V.; Pope, A.E.; Skinner, H.A.,
Thermochemistry of metallic alkyls. Part 10.?Heats of combustion of some tetra-alkyls of tin,
Trans. Faraday Soc., 1963, 59, 2233, https://doi.org/10.1039/tf9635902233
. [all data]
Distefano, Pignataro, et al., 1974
Distefano, G.; Pignataro, S.; Ricci, A.; Colonna, F.P.; Pietropaolo, D.,
Interactions of π-orbitals with the group IV elements studied by ionization energy measurements,
Ann. Chim., 1974, 64, 153. [all data]
Pitt, 1973
Pitt, C.G.,
Hyperconjugation and its role in group IV chemistry,
J. Organomet. Chem., 1973, 61, 49. [all data]
Bischof, Dewar, et al., 1974
Bischof, P.K.; Dewar, M.J.S.; Goodman, D.W.; Jones, T.B.,
Photoelectron spectra of molecules. VI. Hyperconjugation versus pπ-dπ bonding in group IVb compounds,
J. Organomet. Chem., 1974, 82, 89. [all data]
Lang (editor), 1967
Lang (editor), L.,
Absorption Spectra in the Ultraviolet and Visible Region, 1967, 8, 61. [all data]
Putnam and Pu, 1965
Putnam, R.C.; Pu, H.,
Retention indices of organotins,
J. Gas Chromatogr., 1965, 3, 5, 160-164, https://doi.org/10.1093/chromsci/3.5.160
. [all data]
Putnam and Pu, 1965, 2
Putnam, R.C.; Pu, H.,
Retention indices of organotins (II),
J. Gas Chromatogr., 1965, 3, 9, 289-293, https://doi.org/10.1093/chromsci/3.9.289
. [all data]