7-Hydroxycoumarin
- Formula: C9H6O3
- Molecular weight: 162.1421
- IUPAC Standard InChIKey: ORHBXUUXSCNDEV-UHFFFAOYSA-N
- CAS Registry Number: 93-35-6
- Chemical structure:
View 3d structure (requires JavaScript / HTML 5) - Other names: 2H-1-Benzopyran-2-one, 7-hydroxy-; Coumarin, 7-hydroxy-; Hydrangin; Hydrangine; Skimmetin; Skimmetine; Umbelliferon; Umbelliferone; 7-Oxycoumarin; 7 HC; 7-Hydroxy-2-chromenone; NSC 19790; 7-Hydroxy-2H-chromen-2-one; 1391-97-5

Gas phase ion energetics data

Data compiled by: Henry M. Rosenstock, Keith Draxl, Bruce W. Steiner, and John T. Herron
Appearance energy determinations
Ion | AE (eV) | Other Products | Method | Reference | Comment |
---|---|---|---|---|---|
C8H6O2+ | 10.6 | CO | EI | Barnes and Occolowitz, 1964 |

Kovats' RI, non-polar column, isothermal

View large format table.

Column type Active phase Temperature (C) I Reference Comment
CapillaryLM-1170.1789.Soares, Monache, et al., 199925. m/0.25 mm/0.25 μm, H2
CapillaryLM-1190.1797.Soares, Monache, et al., 199925. m/0.25 mm/0.25 μm, H2
CapillaryLM-1210.1795.Soares, Monache, et al., 199925. m/0.25 mm/0.25 μm, H2

Van Den Dool and Kratz RI, non-polar column, custom temperature program

View large format table.

Column type Active phase I Reference Comment
CapillaryHP-5MS1852.5Andriamaharavo, 201430. m/0.25 mm/0.25 μm, He; Program: 60C (1 min) => 5 C/min => 210C => 10 C/min => 280C (15 min)

Normal alkane RI, non-polar column, temperature ramp

View large format table.

Column type Active phase I Reference Comment
CapillaryHP-5 MS1828.Sandoval-Montemayor, Garcia, et al., 201225. m/0.20 mm/0.30 μm, Helium, 40. C @ 2. min, 10. K/min, 260. C @ 20. min
CapillaryDB-51836.Orlita, Sidwa-Gorycka, et al., 2008Argon, 0.9 K/min; Tstart: 80. C; Tend: 200. C

Normal alkane RI, non-polar column, custom temperature program

View large format table.

Column type Active phase I Reference Comment
OtherMethyl Silicone1828.Ardrey and Moffat, 1981Program: not specified

References

Barnes and Occolowitz, 1964
Barnes, C.S.; Occolowitz, J.L.,
The mass spectra of some naturally occurring oxygen heterocycles and related compounds,
Australian J. Chem., 1964, 17, 975. [all data]