1,3-Cyclobutanedione, 2,2,4,4-tetramethyl-
- Formula: C8H12O2
- Molecular weight: 140.1797
- IUPAC Standard InChIKey: RGCDVHNITQEYPO-UHFFFAOYSA-N
- CAS Registry Number: 933-52-8
- Chemical structure:
View 3d structure (requires JavaScript / HTML 5) - Other names: Tetramethyl-1,3-cyclobutanedione; Tetramethylcyclobuta-1,3-dione; 1,1,3,3-Tetramethylcyclobutanedione; 2,2,4,4-Tetramethyl-1,3-cyclobutanedione; 2,2,4,4-Tetramethylcyclobutanedione; 2,2,4,4-Tetramethyl cyclobutane-1,3-dione; tetramethylcyclobutane-1,3-dione

Gas phase thermochemistry data

Data compiled by: Hussein Y. Afeefy, Joel F. Liebman, and Stephen E. Stein
Quantity | Value | Units | Method | Reference | Comment |
---|---|---|---|---|---|
ΔfH°gas | -307.7 ± 1.6 | kJ/mol | Ccb | Sellers, 1971 |

Condensed phase thermochemistry data

Data compiled by: Hussein Y. Afeefy, Joel F. Liebman, and Stephen E. Stein
Quantity | Value | Units | Method | Reference | Comment |
---|---|---|---|---|---|
ΔfH°solid | -379.9 ± 1.5 | kJ/mol | Ccb | Sellers, 1971 | |
Quantity | Value | Units | Method | Reference | Comment |
ΔcH°solid | -4483.2 ± 1.4 | kJ/mol | Ccb | Sellers, 1971 | Corresponding ΔfHºsolid = -379.86 kJ/mol (simple calculation by NIST; no Washburn corrections) |

Phase change data

Data compiled as indicated in comments:
BS - Robert L. Brown and Stephen E. Stein
ALS - Hussein Y. Afeefy, Joel F. Liebman, and Stephen E. Stein
Quantity | Value | Units | Method | Reference | Comment |
---|---|---|---|---|---|
ΔsubH° | 72.2 ± 0.6 | kJ/mol | C | Sellers, 1971 | ALS |
Reduced pressure boiling point
Tboil (K) | Pressure (bar) | Reference | Comment |
---|---|---|---|
400.2 | 1.00 | Aldrich Chemical Company Inc., 1990 | BS |

Gas phase ion energetics data

Data compiled as indicated in comments:
LBLHLM - Sharon G. Lias, John E. Bartmess, Joel F. Liebman, John L. Holmes, Rhoda D. Levin, and W. Gary Mallard
LLK - Sharon G. Lias, Rhoda D. Levin, and Sherif A. Kafafi
Ionization energy determinations
IE (eV) | Method | Reference | Comment |
---|---|---|---|
9.0 ± 0.02 | EI | Olivares, Flesch, et al., 1984 | LBLHLM |
8.80 | PE | Dougherty, Brint, et al., 1978 | Vertical value; LLK |
8.80 | PE | Cowan, Gleiter, et al., 1971 | Vertical value; LLK |
Appearance energy determinations
Ion | AE (eV) | Other Products | Method | Reference | Comment |
---|---|---|---|---|---|
C7H12O+ | 9.6 ± 0.03 | CO | EI | Olivares, Flesch, et al., 1984 | LBLHLM |

References

Sellers, 1971
Sellers, P.,
Enthalpy of formation of tetramethyl-1,3-cyclobutane-dione,
Acta Chem. Scand., 1971, 25, 2291-2294. [all data]
Aldrich Chemical Company Inc., 1990
Aldrich Chemical Company Inc.,
Catalog Handbook of Fine Chemicals, Aldrich Chemical Company, Inc., Milwaukee WI, 1990, 1. [all data]
Olivares, Flesch, et al., 1984
Olivares, J.A.; Flesch, G.D.; Svec, H.J.,
Mass spectrometry of five ketene dimers,
Int. J. Mass Spectrom. Ion Processes, 1984, 56, 293. [all data]
Dougherty, Brint, et al., 1978
Dougherty, D.; Brint, P.; McGlynn, S.P.,
Photoelectron spectroscopy of carbonyls. Lone-pair interactions in α-, β-, γ δ-dicarbonyls,
J. Am. Chem. Soc., 1978, 100, 5597. [all data]
Cowan, Gleiter, et al., 1971
Cowan, D.O.; Gleiter, R.; Hashmall, J.A.; Heilbronner, E.; Hornung, V.,
Interaction between the orbitals of lone pair electrons in dicarbonyl compounds,
Angew. Chem. Int. Ed. Engl., 1971, 10, 401. [all data]