Cyclohexane, 1,1-dimethoxy-
- Formula: C8H16O2
- Molecular weight: 144.2114
- IUPAC Standard InChIKey: XPIJMQVLTXAGME-UHFFFAOYSA-N
- CAS Registry Number: 933-40-4
- Chemical structure:
View 3d structure (requires JavaScript / HTML 5) - Other names: Cyclohexanone, dimethyl acetal; Cyclohexanone dimethyl ketal; 1,1-Dimethoxycyclohexane

Gas phase thermochemistry data

Data compiled by: Hussein Y. Afeefy, Joel F. Liebman, and Stephen E. Stein
Quantity | Value | Units | Method | Reference | Comment |
---|---|---|---|---|---|
ΔfH°gas | -105.5 ± 0.4 | kcal/mol | Cm | Wiberg, Morgan, et al., 1994 |

Condensed phase thermochemistry data

Data compiled by: Hussein Y. Afeefy, Joel F. Liebman, and Stephen E. Stein
Quantity | Value | Units | Method | Reference | Comment |
---|---|---|---|---|---|
ΔfH°liquid | -117.6 ± 0.2 | kcal/mol | Cm | Wiberg, Morgan, et al., 1994 |

Phase change data

Data compiled as indicated in comments:
BS - Robert L. Brown and Stephen E. Stein
AC - William E. Acree, Jr., James S. Chickos
DRB - Donald R. Burgess, Jr.
Quantity | Value | Units | Method | Reference | Comment |
---|---|---|---|---|---|
ΔvapH° | 11.6 ± 0.05 | kcal/mol | GS | Verevkin, 2002 | Based on data from 278. to 308. K.; AC |
ΔvapH° | 12.2 | kcal/mol | N/A | Wiberg, Morgan, et al., 1994 | DRB |
Reduced pressure boiling point
Tboil (K) | Pressure (atm) | Reference | Comment |
---|---|---|---|
327. to 329. | 0.017 | Frinton Laboratories Inc., 1986 | BS |
Enthalpy of vaporization
ΔvapH (kcal/mol) | Temperature (K) | Method | Reference | Comment |
---|---|---|---|---|
11.7 ± 0.05 | 278. to 308. | GS | Verevkin, Peng, et al., 1998 | AC |
12.5 | 331. | EB | Wiberg, Morgan, et al., 1994 | Based on data from 315. to 347. K.; AC |

Reaction thermochemistry data

Data compiled by: Hussein Y. Afeefy, Joel F. Liebman, and Stephen E. Stein
Individual Reactions
By formula: H2O + C8H16O2 = C6H10O + 2CH4O
Quantity | Value | Units | Method | Reference | Comment |
---|---|---|---|---|---|
ΔrH° | 6.90 ± 0.03 | kcal/mol | Cm | Wiberg, Morgan, et al., 1994 | liquid phase |
By formula: C6H10O + 2CH4O = H2O + C8H16O2
Quantity | Value | Units | Method | Reference | Comment |
---|---|---|---|---|---|
ΔrH° | -12.9 ± 0.3 | kcal/mol | Cm | Wiberg, Morgan, et al., 1994 | gas phase |

Gas phase ion energetics data

Data compiled by: Sharon G. Lias, John E. Bartmess, Joel F. Liebman, John L. Holmes, Rhoda D. Levin, and W. Gary Mallard
Ionization energy determinations
IE (eV) | Method | Reference | Comment |
---|---|---|---|
9.0 | PE | Lambert, Xue, et al., 1986 | |
9.52 | PE | Lambert, Xue, et al., 1986 | Vertical value |

References

Wiberg, Morgan, et al., 1994
Wiberg, K.B.; Morgan, K.M.; Maltz, H.,
Thermochemistry of carbonyl reactions. 6. A study of hydration equilibria,
J. Am. Chem. Soc., 1994, 116, 11067-11077. [all data]
Verevkin, 2002
Verevkin, Sergey P.,
Improved Benson Increments for the Estimation of Standard Enthalpies of Formation and Enthalpies of Vaporization of Alkyl Ethers, Acetals, Ketals, and Ortho Esters,
J. Chem. Eng. Data, 2002, 47, 5, 1071-1097, https://doi.org/10.1021/je020023o
. [all data]
Frinton Laboratories Inc., 1986
Frinton Laboratories Inc.,
Catalog Number 11, Frinton Laboratories Inc., Vineland, NJ, 1986, 99. [all data]
Verevkin, Peng, et al., 1998
Verevkin, S.P.; Peng, W.-H.; Beckhaus, H.D.; Rücuardt, C.,
Geminal substituent effects. 16. Does the anomeric effect in ketals depend on the hybridization of the central carbon atom?,
Eur. J. Org. Chem., 1998, 11, 2323. [all data]
Lambert, Xue, et al., 1986
Lambert, J.B.; Xue, L.; Bosch, R.J.; Taba, K.M.; Marko, D.E.; Urano, S.; LeBreton, P.R.,
Through space interactions of double bonds by photoelectron spectroscopy,
J. Am. Chem. Soc., 1986, 108, 7575. [all data]