cis-Cyclononene
- Formula: C9H16
- Molecular weight: 124.2233
- IUPAC Standard InChIKey: BESIOWGPXPAVOS-UPHRSURJSA-N
- CAS Registry Number: 933-21-1
- Chemical structure:
View 3d structure (requires JavaScript / HTML 5) - Stereoisomers:
- Other names: Cyclononene, (Z)-; (Z)-Cyclononene

Reaction thermochemistry data

Data compiled by: Hussein Y. Afeefy, Joel F. Liebman, and Stephen E. Stein
Individual Reactions
By formula: H2 + C9H16 = C9H18
Quantity | Value | Units | Method | Reference | Comment |
---|---|---|---|---|---|
ΔrH° | -98.8 ± 0.3 | kJ/mol | Chyd | Turner and Meador, 1957 | liquid phase; solvent: Acetic acid |
By formula: C9H16 = C9H16
Quantity | Value | Units | Method | Reference | Comment |
---|---|---|---|---|---|
ΔrH° | -12.1 ± 1.4 | kJ/mol | Eqk | Taskinen, 1980 | liquid phase; solvent: Acetic acid |

Gas phase ion energetics data

Data compiled as indicated in comments:
LLK - Sharon G. Lias, Rhoda D. Levin, and Sherif A. Kafafi
Ionization energy determinations
IE (eV) | Method | Reference | Comment |
---|---|---|---|
8.81 ± 0.15 | EI | Remane, Graefe, et al., 1972 | LLK |

Kovats' RI, non-polar column, isothermal

Column type | Active phase | Temperature (C) | I | Reference | Comment |
---|---|---|---|---|---|
Capillary | OV-1 | 100. | 1023.6 | Engewald, Billing, et al., 1987 | Column length: 50. m; Column diameter: 0.3 mm |
Packed | Squalane | 100. | 1029. | Bogoslovsky, Anvaer, et al., 1978 | |
Capillary | Squalane | 120. | 1029. | Engewald, Epsch, et al., 1974 | N2; Column length: 100. m; Column diameter: 0.23 mm |
Capillary | Squalane | 120. | 1029. | Schomburg, 1966 |

References

Turner and Meador, 1957
Turner, R.B.; Meador, W.R.,
Heats of hydrogenation. IV. Hydrogenation of some cis- and trans-cycloolefins,
J. Am. Chem. Soc., 1957, 79, 4133-4136. [all data]
Taskinen, 1980
Taskinen, E.,
Thermodynamics of vinyl ethers. XXVI. Relative stabilities of the geometrical isomers of 8- to 15-membered 1-methoxycycloalkenes,
Acta Chem. Scand., Ser. B, 1980, 643-646. [all data]
Remane, Graefe, et al., 1972
Remane, H.; Graefe, J.; Herzschuh, R.,
Ionisationspotentiale von cis- und trans-Cycloalkenen,
Z. Chem., 1972, 12, 194. [all data]
Engewald, Billing, et al., 1987
Engewald, W.; Billing, U.; Welsch, T.; Haufe, G.,
Structure-retention correlations of hydrocarbons in gas-liquid and gas-solid chromatography. Cycloalkenes and cycloalkadienes,
Chromatographia, 1987, 23, 8, 590-594, https://doi.org/10.1007/BF02324870
. [all data]
Bogoslovsky, Anvaer, et al., 1978
Bogoslovsky, Yu.N.; Anvaer, B.I.; Vigdergauz, M.S.,
Chromatographic constants in gas chromatography (in Russian), Standards Publ. House, Moscow, 1978, 192. [all data]
Engewald, Epsch, et al., 1974
Engewald, W.; Epsch, K.; Graefe, J.; Welsch, Th.,
Molekülstruktur und retentionsverhalten. II. Retentionsverhalten cycloaliphatischer kohlenwasser-stoffe bei der gas-adsorptions- und gas-verteilungschromatographie,
J. Chromatogr., 1974, 91, 623-631, https://doi.org/10.1016/S0021-9673(01)97943-9
. [all data]
Schomburg, 1966
Schomburg, G.,
Gaschromatographische Retentionsdaten und struktur chemischer verbindungen. III. Alkylverzweigte und ungesättigte cyclische Kohlenwasserstoffe,
J. Chromatogr., 1966, 23, 18-41, https://doi.org/10.1016/S0021-9673(01)98653-4
. [all data]