Benzene, 1-chloro-4-nitroso-
- Formula: C6H4ClNO
- Molecular weight: 141.555
- IUPAC Standard InChIKey: IEYSGPZUULPJPQ-UHFFFAOYSA-N
- CAS Registry Number: 932-98-9
- Chemical structure:
View 3d structure (requires JavaScript / HTML 5) - Other names: p-Chloronitrosobenzene; p-Nitrosochlorobenzene; 1-Chloro-4-nitrosobenzene; 4-Chloro-1-nitrosobenzene; 4-Chloronitrosobenzene

Gas phase ion energetics data

Data compiled as indicated in comments:
LLK - Sharon G. Lias, Rhoda D. Levin, and Sherif A. Kafafi
RDSH - Henry M. Rosenstock, Keith Draxl, Bruce W. Steiner, and John T. Herron
Ionization energy determinations
IE (eV) | Method | Reference | Comment |
---|---|---|---|
9.0 ± 0.1 | PE | Egdell, Green, et al., 1975 | Vertical value; LLK |
9.02 | PE | Baker, May, et al., 1968 | Vertical value; RDSH |

References

Egdell, Green, et al., 1975
Egdell, R.; Green, J.C.; Rao, C.N.R.; Gowenlock, B.G.; Pfab, J.,
He(I) photoelectron studies of C-nitroso compounds,
J. Chem. Soc. Faraday Trans. 2, 1975, 988. [all data]
Baker, May, et al., 1968
Baker, A.D.; May, D.P.; Turner, D.W.,
Molecular photoelectron spectroscopy. Part VII. The vertical ionisation potentials of benzene and some of its monosubstituted and 1,4-disubstituted derivatives,
J. Chem. Soc. B, 1968, 22. [all data]