2,5-Cyclohexadien-1-one, 4-diazo-
- Formula: C6H4N2O
- Molecular weight: 120.1088
- IUPAC Standard InChIKey: WTQZSMDDRMKJRI-UHFFFAOYSA-N
- CAS Registry Number: 932-97-8
- Chemical structure:
View 3d structure (requires JavaScript / HTML 5) - Other names: p-Benzoquinone diazide; 1,4-Benzoquinone diazide; 4-Diazo-2,5-cyclohexadien-1-one; p-Diazoquinone; Quinone diazide; p-Quinone diazide

Gas phase ion energetics data

Data compiled by: Sharon G. Lias, Rhoda D. Levin, and Sherif A. Kafafi
Ionization energy determinations
IE (eV) | Method | Reference |
---|---|---|
8.28 ± 0.05 | EI | Thorstad, Undheim, et al., 1974 |
Appearance energy determinations
Ion | AE (eV) | Other Products | Method | Reference | Comment |
---|---|---|---|---|---|
C6H4O+ | 9.6 ± 0.01 | N2 | EI | Thorstad, Undheim, et al., 1974 |

References

Thorstad, Undheim, et al., 1974
Thorstad, O.; Undheim, K.; Hvistendahl, G.,
Mass spectrometry of onium compounds. XXIII. Ionisation potentials in the structural assignment of [M-N2]ions from diazo-oxides,
Org. Mass Spectrom., 1974, 9, 548. [all data]