Benzene, (bromoethynyl)-
- Formula: C8H5Br
- Molecular weight: 181.029
- IUPAC Standard InChIKey: BPVHWNVBBDHIQU-UHFFFAOYSA-N
- CAS Registry Number: 932-87-6
- Chemical structure:
View 3d structure (requires JavaScript / HTML 5) - Other names: (Bromoethynyl)benzene; Bromophenylacetylene; Phenylethynyl bromide; 1-Bromo-2-phenylacetylene; 1-Phenyl-2-bromoacetylene

Gas phase ion energetics data

Data compiled by: Sharon G. Lias, Rhoda D. Levin, and Sherif A. Kafafi
Ionization energy determinations
IE (eV) | Method | Reference | Comment |
---|---|---|---|
8.65 | PE | Griebel, Hohlneicher, et al., 1974 | Vertical value |

References

Griebel, Hohlneicher, et al., 1974
Griebel, R.; Hohlneicher, G.; Dorr, F.,
A photoelectron spectroscopic study of benzonitrile, ethynylbenzene and some of its substituted derivatives,
J. Electron Spectrosc. Relat. Phenom., 1974, 4, 185. [all data]
Lii and Miller, 1973
Lii, R.R.; Miller, S.I.,
J. Am. Chem. Soc., 1973, 95, 1602. [all data]