Cyclooctene
- Formula: C8H14
- Molecular weight: 110.1968
- IUPAC Standard InChIKey: URYYVOIYTNXXBN-UHFFFAOYSA-N
- CAS Registry Number: 931-88-4
- Chemical structure:
View 3d structure (requires JavaScript / HTML 5) - Stereoisomers:
- Other names: (Z)-Cyclooctene

Gas phase thermochemistry data

Data compiled by: Glushko Thermocenter, Russian Academy of Sciences, Moscow
Constant pressure heat capacity of gas
Cp,gas (J/mol*K) | Temperature (K) | Reference | Comment |
---|---|---|---|
36.52 | 50. | Dorofeeva O.V., 1986 | |
52.28 | 100. | ||
72.30 | 150. | ||
93.70 | 200. | ||
129.65 | 273.15 | ||
142.9 ± 6.0 | 298.15 | ||
143.90 | 300. | ||
196.93 | 400. | ||
244.05 | 500. | ||
283.39 | 600. | ||
316.03 | 700. | ||
343.35 | 800. | ||
366.44 | 900. | ||
386.08 | 1000. | ||
402.84 | 1100. | ||
417.21 | 1200. | ||
429.55 | 1300. | ||
440.18 | 1400. | ||
449.39 | 1500. |

Condensed phase thermochemistry data

Data compiled by: Eugene S. Domalski and Elizabeth D. Hearing
Quantity | Value | Units | Method | Reference | Comment |
---|---|---|---|---|---|
S°liquid | 254.5 | J/mol*K | N/A | Lebedev, Lebedev, et al., 1978 |
Constant pressure heat capacity of liquid
Cp,liquid (J/mol*K) | Temperature (K) | Reference | Comment |
---|---|---|---|
207.8 | 298.15 | Lebedev, Lebedev, et al., 1978 | T = 8 to 330 K. |

Phase change data

Data compiled as indicated in comments:
TRC - Thermodynamics Research Center, NIST Boulder Laboratories, Chris Muzny director
AC - William E. Acree, Jr., James S. Chickos
CAL - James S. Chickos, William E. Acree, Jr., Joel F. Liebman, Students of Chem 202 (Introduction to the Literature of Chemistry), University of Missouri -- St. Louis
DH - Eugene S. Domalski and Elizabeth D. Hearing
Quantity | Value | Units | Method | Reference | Comment |
---|---|---|---|---|---|
Ttriple | 259.15 | K | N/A | Lebedev, Lebedev, et al., 1978 | Crystal phase 1 phase; Uncertainty assigned by TRC = 0.02 K; TRC |
Enthalpy of vaporization
ΔvapH (kJ/mol) | Temperature (K) | Method | Reference | Comment |
---|---|---|---|---|
42.0 | 288. | A | Stephenson and Malanowski, 1987 | Based on data from 273. to 411. K.; AC |
41.6 | 300. | N/A | Lister, 1941 | Based on data from 273. to 333. K.; AC |
Enthalpy of fusion
ΔfusH (kJ/mol) | Temperature (K) | Reference | Comment |
---|---|---|---|
1.81 | 259.2 | Lebedev and Smirnova, 1994 | AC |
Entropy of fusion
ΔfusS (J/mol*K) | Temperature (K) | Reference | Comment |
---|---|---|---|
51.55 | 190.1 | Lebedev and Smirnova, 1994, 2 | CAL |
6.98 | 259.2 |
Temperature of phase transition
Ttrs (K) | Initial Phase | Final Phase | Reference | Comment |
---|---|---|---|---|
100. | crystaline, III | crystaline, II | Lebedev, Lebedev, et al., 1978 | Glass transition.; DH |
Enthalpy of phase transition
ΔHtrs (kJ/mol) | Temperature (K) | Initial Phase | Final Phase | Reference | Comment |
---|---|---|---|---|---|
0.635 | 190. | crystaline, II | crystaline, I | Lebedev, Lebedev, et al., 1978 | DH |
1.813 | 259.15 | crystaline, I | liquid | Lebedev, Lebedev, et al., 1978 | DH |
Entropy of phase transition
ΔStrs (J/mol*K) | Temperature (K) | Initial Phase | Final Phase | Reference | Comment |
---|---|---|---|---|---|
3.34 | 190. | crystaline, II | crystaline, I | Lebedev, Lebedev, et al., 1978 | DH |
7.02 | 259.15 | crystaline, I | liquid | Lebedev, Lebedev, et al., 1978 | DH |

Reaction thermochemistry data

Data compiled as indicated in comments:
B - John E. Bartmess
ALS - Hussein Y. Afeefy, Joel F. Liebman, and Stephen E. Stein
Individual Reactions
By formula: C8H13- + H+ = C8H14
Quantity | Value | Units | Method | Reference | Comment |
---|---|---|---|---|---|
ΔrH° | 1617. ± 21. | kJ/mol | G+TS | Lee and Squires, 1986 | gas phase; Between H2O, MeOH; B |
Quantity | Value | Units | Method | Reference | Comment |
ΔrG° | 1586. ± 21. | kJ/mol | IMRB | Lee and Squires, 1986 | gas phase; Between H2O, MeOH; B |
By formula: H2 + C8H14 = C8H16
Quantity | Value | Units | Method | Reference | Comment |
---|---|---|---|---|---|
ΔrH° | -94. ± 1. | kJ/mol | Chyd | Rogers and McLafferty, 1971 | liquid phase; solvent: Acetic acid; ALS |
By formula: Br2 + C8H14 = C8H14Br2
Quantity | Value | Units | Method | Reference | Comment |
---|---|---|---|---|---|
ΔrH° | -122.63 | kJ/mol | Cm | Lister, 1941 | gas phase; Heat of bromination at 300 K; ALS |

Gas phase ion energetics data

Data compiled as indicated in comments:
B - John E. Bartmess
LLK - Sharon G. Lias, Rhoda D. Levin, and Sherif A. Kafafi
Ionization energy determinations
IE (eV) | Method | Reference | Comment |
---|---|---|---|
8.8 | PE | Batich, Bischof, et al., 1973 | LLK |
9.02 | PE | Hentrich, Gunkel, et al., 1974 | Vertical value; LLK |
De-protonation reactions
By formula: C8H13- + H+ = C8H14
Quantity | Value | Units | Method | Reference | Comment |
---|---|---|---|---|---|
ΔrH° | 1617. ± 21. | kJ/mol | G+TS | Lee and Squires, 1986 | gas phase; Between H2O, MeOH; B |
Quantity | Value | Units | Method | Reference | Comment |
ΔrG° | 1586. ± 21. | kJ/mol | IMRB | Lee and Squires, 1986 | gas phase; Between H2O, MeOH; B |

Kovats' RI, non-polar column, isothermal

Column type | Active phase | Temperature (C) | I | Reference | Comment |
---|---|---|---|---|---|
Capillary | SE-30 | 130. | 922. | Bredael, 1982 | Column length: 100. m; Column diameter: 0.5 mm |
Capillary | SE-30 | 80. | 900. | Bredael, 1982 | Column length: 100. m; Column diameter: 0.5 mm |
Packed | Squalane | 100. | 905. | Bogoslovsky, Anvaer, et al., 1978 | |
Packed | Squalane | 120. | 913. | Bogoslovsky, Anvaer, et al., 1978 | |
Packed | Squalane | 27. | 875. | Bogoslovsky, Anvaer, et al., 1978 | |
Packed | Squalane | 49. | 884. | Bogoslovsky, Anvaer, et al., 1978 | |
Packed | Squalane | 67. | 892. | Bogoslovsky, Anvaer, et al., 1978 | |
Packed | Squalane | 80. | 895. | Bogoslovsky, Anvaer, et al., 1978 | |
Packed | Squalane | 86. | 900. | Bogoslovsky, Anvaer, et al., 1978 | |
Capillary | Squalane | 100. | 904. | Besson and Gäumann, 1973 | Column length: 50. m; Column diameter: 0.25 mm |
Capillary | Apiezon L | 100. | 931. | Besson and Gäumann, 1973 | Column length: 50. m; Column diameter: 0.25 mm |
Packed | Squalane | 27. | 875. | Hively and Hinton, 1968 | He, Chromosorb P; Column length: 15. m; Column diameter: 0.25 mm |
Packed | Squalane | 49. | 884. | Hively and Hinton, 1968 | He, Chromosorb P; Column length: 15. m; Column diameter: 0.25 mm |
Packed | Squalane | 67. | 892. | Hively and Hinton, 1968 | He, Chromosorb P; Column length: 15. m; Column diameter: 0.25 mm |
Packed | Squalane | 86. | 900. | Hively and Hinton, 1968 | He, Chromosorb P; Column length: 15. m; Column diameter: 0.25 mm |
Packed | Apiezon L | 130. | 945. | Wehrli and Kováts, 1959 | Celite; Column length: 2.25 m |

Van Den Dool and Kratz RI, non-polar column, temperature ramp

Column type | Active phase | I | Reference | Comment |
---|---|---|---|---|
Capillary | Petrocol DH | 888. | White, Hackett, et al., 1992 | 100. m/0.25 mm/0.5 μm, He, 1. K/min; Tstart: 30. C; Tend: 220. C |
Packed | SE-30 | 910. | Buchman, Cao, et al., 1984 | He, Chromosorb AW, 40. C @ 10. min, 10. K/min, 210. C @ 30. min; Column length: 3.05 m |

Normal alkane RI, non-polar column, temperature ramp

Column type | Active phase | I | Reference | Comment |
---|---|---|---|---|
Capillary | Petrocol DH | 889. | Supelco, 2012 | 100. m/0.25 mm/0.50 μm, Helium, 20. C @ 15. min, 15. K/min, 220. C @ 30. min |

Normal alkane RI, non-polar column, custom temperature program

Column type | Active phase | I | Reference | Comment |
---|---|---|---|---|
Capillary | Squalane | 899. | Chen, 2008 | Program: not specified |
Capillary | Methyl Silicone | 945. | N/A | Program: not specified |
Capillary | OV-1, SE-30, Methyl silicone, SP-2100, OV-101, DB-1, etc. | 900. | Waggott and Davies, 1984 | Hydrogen; Column length: 50. m; Column diameter: 0.32 mm; Program: not specified |
Capillary | OV-1, SE-30, Methyl silicone, SP-2100, OV-101, DB-1, etc. | 910. | Waggott and Davies, 1984 | Hydrogen; Column length: 50. m; Column diameter: 0.32 mm; Program: not specified |

Normal alkane RI, polar column, temperature ramp

Column type | Active phase | I | Reference | Comment |
---|---|---|---|---|
Capillary | DB-Wax | 955. | Chung, Eiserich, et al., 1993 | 60. C @ 4. min, 3. K/min; Column length: 60. m; Column diameter: 0.25 mm; Tend: 220. C |

Normal alkane RI, polar column, custom temperature program

Column type | Active phase | I | Reference | Comment |
---|---|---|---|---|
Capillary | DB-Wax | 1035. | Peng, Yang, et al., 1991 | Program: not specified |

References

Dorofeeva O.V., 1986
Dorofeeva O.V.,
Thermodynamic properties of twenty-one monocyclic hydrocarbons,
J. Phys. Chem. Ref. Data, 1986, 15, 437-464. [all data]
Lebedev, Lebedev, et al., 1978
Lebedev, B.V.; Lebedev, N.K.; Lityagov, Y.Va.; Mukhina, N.N.,
Thermodynamic characteristics of cyclooctene and polyoctenylene and process for the polymerization of cyclooctene in the range 8-330 K,
Termodin. Org. Soedin., 1978, (7), 23-37. [all data]
Stephenson and Malanowski, 1987
Stephenson, Richard M.; Malanowski, Stanislaw,
Handbook of the Thermodynamics of Organic Compounds, 1987, https://doi.org/10.1007/978-94-009-3173-2
. [all data]
Lister, 1941
Lister, M.W.,
Heats of organic reactions. X. Heats of bromination of cyclic olefins,
J. Am. Chem. Soc., 1941, 63, 143-149. [all data]
Lebedev and Smirnova, 1994
Lebedev, B.; Smirnova, N.,
Themodynamics of cycloalkenes, of their bulk polymerization in the presence of matathesis catalysts and of polyalkenes,
Macromol. Chem. Phys., 1994, 195, 35-63. [all data]
Lebedev and Smirnova, 1994, 2
Lebedev, B.; Smirnova, N.,
Thermodynamics of cycloalkenes, of their bulk polymerization in the presence of matathesis catalysts and of polyalkenes,
Macromol. Chem. Phys., 1994, 195, 1, 35, https://doi.org/10.1002/macp.1994.021950105
. [all data]
Lee and Squires, 1986
Lee, R.E.; Squires, R.R.,
Anionic homoaromaticity: A gas phase experimental study,
J. Am. Chem. Soc., 1986, 105, 5078. [all data]
Rogers and McLafferty, 1971
Rogers, D.W.; McLafferty, F.J.,
A new hydrogen calorimeter. Heats of hydrogenation of allyl and vinyl unsaturation adjacent to a ring,
Tetrahedron, 1971, 27, 3765-3775. [all data]
Batich, Bischof, et al., 1973
Batich, C.; Bischof, P.; Heilbronner, E.,
The photoelectron spectra of cyclooctatetraene and its hydrogenated derivatives,
J. Electron Spectrosc. Relat. Phenom., 1973, 1, 333. [all data]
Hentrich, Gunkel, et al., 1974
Hentrich, G.; Gunkel, E.; Klessinger, M.,
Photoelektronenspektren organischer verbindungen. 4. Photoelektronenspektren ungesattigter carbonylverbindungen,
J. Mol. Struct., 1974, 21, 231. [all data]