Pyrimidine, 2-methoxy-
- Formula: C5H6N2O
- Molecular weight: 110.1139
- IUPAC Standard InChIKey: YLZYSVYZMDJYOT-UHFFFAOYSA-N
- CAS Registry Number: 931-63-5
- Chemical structure:
View 3d structure (requires JavaScript / HTML 5) - Other names: 2-Methoxypyrimidine

Gas phase ion energetics data

Data compiled by: Sharon G. Lias, Rhoda D. Levin, and Sherif A. Kafafi
Ionization energy determinations
IE (eV) | Method | Reference |
---|---|---|
9.66 ± 0.05 | EI | Gacek, Thorstad, et al., 1978 |

References

Gacek, Thorstad, et al., 1978
Gacek, M.; Thorstad, O.; Ongstad, L.; Undheim, K.,
Ionisation potentials in tautomer analysis of 2-hydroxypyrimidines,
Chem. Scr., 1978, 13, 99. [all data]