Cyclohexylacetylene
- Formula: C8H12
- Molecular weight: 108.1809
- IUPAC Standard InChIKey: SSDZYLQUYMOSAK-UHFFFAOYSA-N
- CAS Registry Number: 931-48-6
- Chemical structure:
View 3d structure (requires JavaScript / HTML 5) - Other names: Cyclohexylethyne; Cyclohexane, ethynyl-; ethynylcyclohexane

Gas phase ion energetics data

Data compiled as indicated in comments:
LLK - Sharon G. Lias, Rhoda D. Levin, and Sherif A. Kafafi
Ionization energy determinations
IE (eV) | Method | Reference | Comment |
---|---|---|---|
9.92 | PE | Bruckmann and Klessinger, 1973 | Vertical value; LLK |

References

Bruckmann and Klessinger, 1973
Bruckmann, P.; Klessinger, M.,
Photoelektronenspektren organischer verbindungen. III. Photoelektronenspektren acetylensubstituierter kleiner ringe,
J. Electron Spectrosc. Relat. Phenom., 1973, 2, 341. [all data]