Cyclohexanol, 2-amino-, cis-
- Formula: C6H13NO
- Molecular weight: 115.1735
- IUPAC Standard InChIKey: PQMCFTMVQORYJC-RITPCOANSA-N
- CAS Registry Number: 931-15-7
- Chemical structure:
View 3d structure (requires JavaScript / HTML 5) - Stereoisomers:
- Other names: cis-2-Aminocyclohexanol; 2-Aminocyclohexanol, cis

Phase change data

Data compiled by: Robert L. Brown and Stephen E. Stein
Quantity | Value | Units | Method | Reference | Comment |
---|---|---|---|---|---|
Tfus | 380. to 381. | K | N/A | Buckingham and Donaghy, 1982 |
Reduced pressure boiling point
Tboil (K) | Pressure (bar) | Reference |
---|---|---|
381. to 383. | 0.020 | Buckingham and Donaghy, 1982 |

Gas phase ion energetics data

Data compiled by: Sharon G. Lias, Rhoda D. Levin, and Sherif A. Kafafi
Ionization energy determinations
IE (eV) | Method | Reference | Comment |
---|---|---|---|
9.59 | PE | Brown, 1976 | Vertical value |

References

Buckingham and Donaghy, 1982
Buckingham, J.; Donaghy, S.M.,
Dictionary of Organic Compounds: Fifth Edition, Chapman and Hall, New York, 1982, 1. [all data]
Brown, 1976
Brown, R.S.,
Application of photoelectron spectroscopy to intramolecularly hydrogen-bonded systems. Part III. The photoelectron spectra of cis and trans 2-substituted cyclopentanols cis and trans 2-substituted cyclohexanols,
Can. J. Chem., 1976, 54, 1929. [all data]