2-Naphthyl methyl ketone
- Formula: C12H10O
- Molecular weight: 170.2072
- IUPAC Standard InChIKey: XSAYZAUNJMRRIR-UHFFFAOYSA-N
- CAS Registry Number: 93-08-3
- Chemical structure:
View 3d structure (requires JavaScript / HTML 5) - Other names: 2'-Acetonaphthone; 2-Acetonaphthone; 2-Acetylnaphthalene; Ethanone, 1-(2-naphthalenyl)-; β-Acetonaphthalene; β-Acetonaphthone; β-Acetylnaphthalene; β-Methyl naphthyl ketone; β-Naphthyl methyl ketone; Acetonaphthone; Ketone, methyl 2-naphthyl; Methyl β-naphthyl ketone; Methyl 2-naphthyl ketone; Oranger cyrstals; 1-(2-Naphthalenyl)ethanone; NSC 7658

Phase change data

Data compiled as indicated in comments:
BS - Robert L. Brown and Stephen E. Stein
TRC - Thermodynamics Research Center, NIST Boulder Laboratories, Chris Muzny director
AC - William E. Acree, Jr., James S. Chickos
ALS - Hussein Y. Afeefy, Joel F. Liebman, and Stephen E. Stein
Quantity | Value | Units | Method | Reference | Comment |
---|---|---|---|---|---|
Tboil | 573.7 | K | N/A | Aldrich Chemical Company Inc., 1990 | BS |
Tboil | 575.2 | K | N/A | Weast and Grasselli, 1989 | BS |
Tboil | 574. to 576. | K | N/A | Buckingham and Donaghy, 1982 | BS |
Quantity | Value | Units | Method | Reference | Comment |
Tfus | 329. | K | N/A | Buckingham and Donaghy, 1982 | BS |
Tfus | 325.2 | K | N/A | Koelbel, 1949 | Uncertainty assigned by TRC = 1. K; TRC |
Reduced pressure boiling point
Tboil (K) | Pressure (bar) | Reference | Comment |
---|---|---|---|
445.2 | 0.023 | Weast and Grasselli, 1989 | BS |
444. to 446. | 0.023 | Buckingham and Donaghy, 1982 | BS |
Enthalpy of vaporization
ΔvapH (kJ/mol) | Temperature (K) | Method | Reference | Comment |
---|---|---|---|---|
74.1 | 408. | A | Stephenson and Malanowski, 1987 | Based on data from 393. to 574. K.; AC |
Enthalpy of sublimation
ΔsubH (kJ/mol) | Temperature (K) | Method | Reference | Comment |
---|---|---|---|---|
87.86 ± 0.42 | 328.8 | V | Aihara, 1959 | crystal phase; ALS |
87.9 ± 0.4 | 305. | V | Aihara, 1959, 2 | Based on data from 295. to 316. K. See also Stephenson and Malanowski, 1987.; AC |

Gas phase ion energetics data

Data compiled by: Sharon G. Lias, Rhoda D. Levin, and Sherif A. Kafafi
Ionization energy determinations
IE (eV) | Method | Reference | Comment |
---|---|---|---|
8.31 | PE | Utsunomiya, Kobayashi, et al., 1975 | Vertical value |

Kovats' RI, non-polar column, isothermal

Column type | Active phase | Temperature (C) | I | Reference | Comment |
---|---|---|---|---|---|
Capillary | SE-30 | 100. | 1598.4 | Tudor, 1997 | 40. m/0.35 mm/0.35 μm |

Van Den Dool and Kratz RI, non-polar column, temperature ramp

Column type | Active phase | I | Reference | Comment |
---|---|---|---|---|
Capillary | HP-5MS | 1604. | Grujic-Jovanovic, Skaltsa, et al., 2004 | 30. m/0.25 mm/0.25 μm, He, 60. C @ 5. min, 4. K/min; Tend: 280. C |

References

Aldrich Chemical Company Inc., 1990
Aldrich Chemical Company Inc.,
Catalog Handbook of Fine Chemicals, Aldrich Chemical Company, Inc., Milwaukee WI, 1990, 1. [all data]
Weast and Grasselli, 1989
CRC Handbook of Data on Organic Compounds, 2nd Editon, Weast,R.C and Grasselli, J.G., ed(s)., CRC Press, Inc., Boca Raton, FL, 1989, 1. [all data]
Buckingham and Donaghy, 1982
Buckingham, J.; Donaghy, S.M.,
Dictionary of Organic Compounds: Fifth Edition, Chapman and Hall, New York, 1982, 1. [all data]
Koelbel, 1949
Koelbel, H.,
Alkylnaphthalenes as Lubricating-oil Models,
Brennst.-Chem., 1949, 30, 73-80. [all data]
Stephenson and Malanowski, 1987
Stephenson, Richard M.; Malanowski, Stanislaw,
Handbook of the Thermodynamics of Organic Compounds, 1987, https://doi.org/10.1007/978-94-009-3173-2
. [all data]
Aihara, 1959
Aihara, A.,
Estimation of the energy of hydrogen bonds formed in crystals. I. Sublimation pressures of some organic molecular crystals and the additivity of lattice energy,
Bull. Chem. Soc. Jpn., 1959, 32, 1242. [all data]
Aihara, 1959, 2
Aihara, Ariyuki,
Estimation of the Energy of Hydrogen Bonds Formed in Crystals. I. Sublimation Pressures of Some Organic Molecular Crystals and the Additivity of Lattice Energy,
Bull. Chem. Soc. Jpn., 1959, 32, 11, 1242-1248, https://doi.org/10.1246/bcsj.32.1242
. [all data]
Utsunomiya, Kobayashi, et al., 1975
Utsunomiya, C.; Kobayashi, T.; Nagakura, S.,
Photoelectron spectra of substituted naphthalenes,
Bull. Chem. Soc. Jpn., 1975, 48, 1852. [all data]
Bardina, et al., 1971
Bardina, A.A., et al.,
Zhur. Organ. Khim., 1971, 7, 1307. [all data]
Tudor, 1997
Tudor, E.,
Temperature dependence of the retention index for perfumery compounds on a SE-30 glass capillary column. I. Linear equations,
J. Chromatogr. A, 1997, 779, 1-2, 287-297, https://doi.org/10.1016/S0021-9673(97)00453-6
. [all data]
Grujic-Jovanovic, Skaltsa, et al., 2004
Grujic-Jovanovic, S.; Skaltsa, H.D.; Marin, P.; Sokovic, M.,
Composition and antibacterial activity of the essential oil of six Stachys species from Serbia,
Flavour Fragr. J., 2004, 19, 2, 139-144, https://doi.org/10.1002/ffj.1275
. [all data]