Naphthalene, 2-methoxy-
- Formula: C11H10O
- Molecular weight: 158.1965
- IUPAC Standard InChIKey: LUZDYPLAQQGJEA-UHFFFAOYSA-N
- CAS Registry Number: 93-04-9
- Chemical structure:
View 3d structure (requires JavaScript / HTML 5) - Other names: β-Methoxynaphthalene; β-Naphthol methyl ether; β-Naphthyl methyl ether; Methyl β-naphthyl ether; Methyl 2-naphthyl ether; Nerolin; Yara yara; Yura yara; 2-Methoxynaphthalene; 2-Naphthol methyl ether; 2-Naphthyl methyl ether; Nerolin (old); NSC 4171

Condensed phase thermochemistry data

Data compiled by: Hussein Y. Afeefy, Joel F. Liebman, and Stephen E. Stein
Quantity | Value | Units | Method | Reference | Comment |
---|---|---|---|---|---|
ΔfH°solid | -97.9 ± 1.8 | kJ/mol | Ccb | Colomina, Roux, et al., 1976 | |
Quantity | Value | Units | Method | Reference | Comment |
ΔcH°solid | -5659.9 ± 1.1 | kJ/mol | Ccb | Colomina, Roux, et al., 1976 | Corresponding ΔfHºsolid = -97.88 kJ/mol (simple calculation by NIST; no Washburn corrections) |

Phase change data

Data compiled by: Robert L. Brown and Stephen E. Stein
Quantity | Value | Units | Method | Reference | Comment |
---|---|---|---|---|---|
Tboil | 547.2 | K | N/A | Aldrich Chemical Company Inc., 1990 |

Gas phase ion energetics data

Data compiled as indicated in comments:
LBLHLM - Sharon G. Lias, John E. Bartmess, Joel F. Liebman, John L. Holmes, Rhoda D. Levin, and W. Gary Mallard
LLK - Sharon G. Lias, Rhoda D. Levin, and Sherif A. Kafafi
Ionization energy determinations
IE (eV) | Method | Reference | Comment |
---|---|---|---|
7.44 | PE | Klasinc, Kovac, et al., 1983 | LBLHLM |
7.82 | PE | Klasinc, Kovac, et al., 1983 | Vertical value; LBLHLM |
7.87 | PE | Bock and Wagner, 1972 | Vertical value; LLK |

Kovats' RI, non-polar column, isothermal

Column type | Active phase | Temperature (C) | I | Reference | Comment |
---|---|---|---|---|---|
Capillary | SE-30 | 100. | 1433.2 | Tudor, 1997 | 40. m/0.35 mm/0.35 μm |

Normal alkane RI, non-polar column, temperature ramp

Column type | Active phase | I | Reference | Comment |
---|---|---|---|---|
Capillary | Ultra-1 | 1407. | Okumura, 1991 | 25. m/0.32 mm/0.25 μm, He, 3. K/min; Tstart: 80. C; Tend: 260. C |

Normal alkane RI, non-polar column, custom temperature program

Column type | Active phase | I | Reference | Comment |
---|---|---|---|---|
Capillary | OV-1, SE-30, Methyl silicone, SP-2100, OV-101, DB-1, etc. | 1410. | Waggott and Davies, 1984 | Hydrogen; Column length: 50. m; Column diameter: 0.32 mm; Program: not specified |

References

Colomina, Roux, et al., 1976
Colomina, M.; Roux, M.V.; Turrion, C.,
Thermochemical properties of naphthalene compounds. IV. Enthalpies of combustion and formation of 2-methoxynaphthalene, 2-ethoxynaphthalene, and 2,3- and 2,7-dihydroxynaphthalenes,
J. Chem. Thermodyn., 1976, 8, 869-872. [all data]
Aldrich Chemical Company Inc., 1990
Aldrich Chemical Company Inc.,
Catalog Handbook of Fine Chemicals, Aldrich Chemical Company, Inc., Milwaukee WI, 1990, 1. [all data]
Klasinc, Kovac, et al., 1983
Klasinc, L.; Kovac, B.; Gusten, H.,
Photoelectron spectra of acenes. Electronic structure and substituent effects,
Pure Appl. Chem., 1983, 55, 289. [all data]
Bock and Wagner, 1972
Bock, H.; Wagner, G.,
Electron lone pairs in organic sulfides and disulfides,
Angew. Chem. Int. Ed. Engl., 1972, 11, 119. [all data]
Ramart-Lucas, 1950
Ramart-Lucas, P.,
Introduction a l'etude du comportement spectral des combinaisons polynucleaires,
Bull. Soc. Chim. Fr., 1950, 17, 259-265. [all data]
Tudor, 1997
Tudor, E.,
Temperature dependence of the retention index for perfumery compounds on a SE-30 glass capillary column. I. Linear equations,
J. Chromatogr. A, 1997, 779, 1-2, 287-297, https://doi.org/10.1016/S0021-9673(97)00453-6
. [all data]
Okumura, 1991
Okumura, T.,
retention indices of environmental chemicals on methyl silicone capillary column,
Journal of Environmental Chemistry (Japan), 1991, 1, 2, 333-358, https://doi.org/10.5985/jec.1.333
. [all data]
Waggott and Davies, 1984
Waggott, A.; Davies, I.W.,
Identification of organic pollutants using linear temperature programmed retention indices (LTPRIs) - Part II, 1984, retrieved from http://dwi.defra.gov.uk/research/completed-research/reports/dwi0383.pdf. [all data]