1,3-Dithiole-2-thione
- Formula: C3H2S3
- Molecular weight: 134.243
- IUPAC Standard InChIKey: WYKJWNVWJOKVQP-UHFFFAOYSA-N
- CAS Registry Number: 930-35-8
- Chemical structure:
View 3d structure (requires JavaScript / HTML 5) - Other names: 1,3-Dithiol-2-thione; Vinylene trithiocarbonate; 1,3-Dithiacyclopentane, 2-thione-

Gas phase thermochemistry data

Data compiled by: Hussein Y. Afeefy, Joel F. Liebman, and Stephen E. Stein
Quantity | Value | Units | Method | Reference | Comment |
---|---|---|---|---|---|
ΔfH°gas | 253.0 ± 6.7 | kJ/mol | Ccb | Rauh and Geiseler, 1973 | Reanalyzed by Cox and Pilcher, 1970, Original value = 254. ± 6.7 kJ/mol |

Condensed phase thermochemistry data

Data compiled by: Hussein Y. Afeefy, Joel F. Liebman, and Stephen E. Stein
Quantity | Value | Units | Method | Reference | Comment |
---|---|---|---|---|---|
ΔcH°solid | -3441. ± 6.7 | kJ/mol | Ccb | Rauh and Geiseler, 1973 |

Phase change data

Data compiled as indicated in comments:
AC - William E. Acree, Jr., James S. Chickos
ALS - Hussein Y. Afeefy, Joel F. Liebman, and Stephen E. Stein
Quantity | Value | Units | Method | Reference | Comment |
---|---|---|---|---|---|
ΔsubH° | 75.4 ± 0.4 | kJ/mol | N/A | Rauh and Geiseler, 1973, 2 | See also Pedley and Rylance, 1977.; AC |
ΔsubH° | 85.4 ± 0.4 | kJ/mol | V | Rauh and Geiseler, 1973 | ALS |

Gas phase ion energetics data

Data compiled by: Sharon G. Lias, Rhoda D. Levin, and Sherif A. Kafafi
Ionization energy determinations
IE (eV) | Method | Reference | Comment |
---|---|---|---|
8.26 | PE | Guimon, Pfister-Guillouzo, et al., 1976 | Vertical value |
8.3 | PE | Wittel, Astrup, et al., 1975 | Vertical value |

References

Rauh and Geiseler, 1973
Rauh, V.H.J.; Geiseler, G.,
Bildungsenthalpien und mesomerieenergien von π-bindungssystemen. 6. Mitteilung: Zur stabilität der isotrithione und isodithione,
Z. Phys. Chem. (Leipzig), 1973, 252, 395-397. [all data]
Cox and Pilcher, 1970
Cox, J.D.; Pilcher, G.,
Thermochemistry of Organic and Organometallic Compounds, Academic Press, New York, 1970, 1-636. [all data]
Rauh and Geiseler, 1973, 2
Rauh, H.-J.; Geiseler, G.,
Z. Phys. Chem. (Leipzig), 1973, 252, 395. [all data]
Pedley and Rylance, 1977
Pedley, J.B.; Rylance, J.,
, Computer Analysed Thermochemical Data: Organic and Organometallic Compounds, University of Sussex, Brighton, 1977. [all data]
Guimon, Pfister-Guillouzo, et al., 1976
Guimon, C.; Pfister-Guillouzo, G.; Arbelot, M.,
Spectres photoelectroniques de la dithiole-1,3-thione-2 et de son derive benzosubtitue,
J. Mol. Struct., 1976, 30, 339. [all data]
Wittel, Astrup, et al., 1975
Wittel, K.; Astrup, E.E.; Bock, H.; Graeffe, G.; Juslen, H.,
Photoelectron spectra and molecular properties, XLVIII Carbonates thio- carbonates,
Z. Naturforsch. B:, 1975, 30, 862. [all data]