Furan, 3-methyl-
- Formula: C5H6O
- Molecular weight: 82.1005
- IUPAC Standard InChIKey: KJRRQXYWFQKJIP-UHFFFAOYSA-N
- CAS Registry Number: 930-27-8
- Chemical structure:
View 3d structure (requires JavaScript / HTML 5) - Other names: 3-Methylfuran; 3-Methylfurane

Gas phase thermochemistry data

Data compiled by: Glushko Thermocenter, Russian Academy of Sciences, Moscow
Constant pressure heat capacity of gas
Cp,gas (J/mol*K) | Temperature (K) | Reference | Comment |
---|---|---|---|
37.03 | 50. | Thermodynamics Research Center, 1997 | p=1 bar. |
46.12 | 100. | ||
54.50 | 150. | ||
64.59 | 200. | ||
83.25 | 273.15 | ||
90.18 | 298.15 | ||
90.70 | 300. | ||
117.89 | 400. | ||
141.43 | 500. | ||
160.67 | 600. | ||
176.39 | 700. | ||
189.40 | 800. | ||
200.30 | 900. | ||
209.54 | 1000. | ||
217.41 | 1100. | ||
224.14 | 1200. | ||
229.93 | 1300. | ||
234.93 | 1400. | ||
239.25 | 1500. |

Gas phase ion energetics data

Data evaluated as indicated in comments:
HL - Edward P. Hunter and Sharon G. Lias
Data compiled as indicated in comments:
LBLHLM - Sharon G. Lias, John E. Bartmess, Joel F. Liebman, John L. Holmes, Rhoda D. Levin, and W. Gary Mallard
LLK - Sharon G. Lias, Rhoda D. Levin, and Sherif A. Kafafi
Quantity | Value | Units | Method | Reference | Comment |
---|---|---|---|---|---|
Proton affinity (review) | 854.0 | kJ/mol | N/A | Hunter and Lias, 1998 | HL |
Quantity | Value | Units | Method | Reference | Comment |
Gas basicity | 821.5 | kJ/mol | N/A | Hunter and Lias, 1998 | HL |
Ionization energy determinations
IE (eV) | Method | Reference | Comment |
---|---|---|---|
8.64 | EI | Spilker and Grutzmacher, 1986 | LBLHLM |
8.58 | CTS | Aloisi, Santini, et al., 1975 | LLK |
8.70 | PE | Colonna, Distefano, et al., 1979 | Vertical value; LLK |
Appearance energy determinations
Ion | AE (eV) | Other Products | Method | Reference | Comment |
---|---|---|---|---|---|
C5H5O+ | 10.65 | H | EI | Spilker and Grutzmacher, 1986 | LBLHLM |

Kovats' RI, polar column, temperature ramp

Column type | Active phase | I | Reference | Comment |
---|---|---|---|---|
Capillary | DB-Wax | 851. | Shimoda and Shibamoto, 1990 | He, 40. C @ 6. min, 3. K/min; Column length: 60. m; Column diameter: 0.25 mm; Tend: 190. C |

Van Den Dool and Kratz RI, non-polar column, temperature ramp

Column type | Active phase | I | Reference | Comment |
---|---|---|---|---|
Capillary | DB-1 | 602.2 | Helmig, Klinger, et al., 1999 | 60. m/0.32 mm/1. μm, -50. C @ 2. min, 6. K/min; Tend: 175. C |

Van Den Dool and Kratz RI, non-polar column, custom temperature program

Column type | Active phase | I | Reference | Comment |
---|---|---|---|---|
Capillary | DB-5 | 646. | Moon, Cliff, et al., 2006 | 30. m/0.32 mm/0.25 μm, He; Program: 40C(3min) => 3C/min => 180C => 10C/min => 260C(2min) |

Van Den Dool and Kratz RI, polar column, custom temperature program

Column type | Active phase | I | Reference | Comment |
---|---|---|---|---|
Capillary | Carbowax | 851. | Baltes w. and Bochmann G., 1987 | Column diameter: 0.3 mm; Program: not specified |
Capillary | Carbowax | 852. | Baltes w. and Bochmann G., 1987 | Column diameter: 0.3 mm; Program: not specified |
Capillary | Carbowax | 853. | Baltes w. and Bochmann G., 1987 | Column diameter: 0.3 mm; Program: not specified |
Capillary | Carbowax | 853. | Baltes w. and Bochmann G., 1987 | Column diameter: 0.3 mm; Program: not specified |
Capillary | Carbowax | 854. | Baltes w. and Bochmann G., 1987 | Column diameter: 0.3 mm; Program: not specified |
Capillary | Carbowax | 854. | Baltes w. and Bochmann G., 1987 | Column diameter: 0.3 mm; Program: not specified |

Normal alkane RI, non-polar column, temperature ramp

Column type | Active phase | I | Reference | Comment |
---|---|---|---|---|
Capillary | HP-5 | 611.1 | Leffingwell and Alford, 2005 | 60. m/0.32 mm/0.25 μm, He, 30. C @ 2. min, 2. K/min, 260. C @ 28. min |
Capillary | Methyl Silicone | 602.96 | Baraldi, Rapparini, et al., 1999 | 60. m/0.25 mm/0.25 μm, 40. C @ 10. min, 5. K/min; Tend: 220. C |
Capillary | DB-1 | 603. | Barrefors, Björkqvist, et al., 1996 | 50. m/0.32 mm/1. μm, 3. K/min; Tstart: -30. C |

Normal alkane RI, non-polar column, custom temperature program

Column type | Active phase | I | Reference | Comment |
---|---|---|---|---|
Capillary | SE-30 | 620. | Vinogradov, 2004 | Program: not specified |
Capillary | SPB-5 | 614. | Begnaud, Pérès, et al., 2003 | 60. m/0.32 mm/1. μm; Program: not specified |
Capillary | DB-1 | 602. | Ciccioli, Cecinato, et al., 1994 | 60. m/0.32 mm/0.25 μm; Program: not specified |
Capillary | DB-1 | 602. | Ciccioli, Brancaleoni, et al., 1993 | 60. m/0.32 mm/0.25 μm; Program: 3 min at 5 C; 5 - 50 C at 3 deg/min; 50 - 220 C at 5 deg/min |
Capillary | DB-1 | 600. | Takeoka, Flath, et al., 1988 | 30. m/0.25 mm/0.25 μm, H2; Program: 30C (2min) => 2C/min => 150C => 4C/min => 250C |

Normal alkane RI, polar column, temperature ramp

Column type | Active phase | I | Reference | Comment |
---|---|---|---|---|
Capillary | HP-Wax | 858. | Sanz, Maeztu, et al., 2002 | 60. m/0.25 mm/0.5 μm, He, 40. C @ 6. min, 3. K/min; Tend: 190. C |
Capillary | HP-Wax | 832. | Maeztu, Sanz, et al., 2001 | 60. m/0.25 mm/0.5 μm, He, 40. C @ 6. min, 3. K/min; Tend: 190. C |
Capillary | HP-Wax | 832. | Sanz, Ansorena, et al., 2001 | 60. m/0.25 mm/0.5 μm, He, 40. C @ 6. min, 3. K/min; Tend: 190. C |
Capillary | Supelcowax-10 | 901. | Girard and Durance, 2000 | 60. m/0.25 mm/0.25 μm, He, 35. C @ 10. min, 4. K/min; Tend: 200. C |

Normal alkane RI, polar column, custom temperature program

Column type | Active phase | I | Reference | Comment |
---|---|---|---|---|
Capillary | Carbowax 20M | 877. | Vinogradov, 2004 | Program: not specified |

References

Thermodynamics Research Center, 1997
Thermodynamics Research Center,
Selected Values of Properties of Chemical Compounds., Thermodynamics Research Center, Texas A&M University, College Station, Texas, 1997. [all data]
Hunter and Lias, 1998
Hunter, E.P.; Lias, S.G.,
Evaluated Gas Phase Basicities and Proton Affinities of Molecules: An Update,
J. Phys. Chem. Ref. Data, 1998, 27, 3, 413-656, https://doi.org/10.1063/1.556018
. [all data]
Spilker and Grutzmacher, 1986
Spilker, R.; Grutzmacher, H.-F.,
Isomerization and fragmentation of methylfuran ions and pyran ions in the gas phase,
Org. Mass Spectrom., 1986, 21, 459. [all data]
Aloisi, Santini, et al., 1975
Aloisi, G.; Santini, S.; Savelli, G.,
Molecular complexes of heteroaromatic five membered ring compounds with tetracyanoethylene. Charge transfer spectra, equilibrium constants and ionization potentials of the donors,
J. Chem. Soc. Faraday Trans. 1, 1975, 70, 2045. [all data]
Colonna, Distefano, et al., 1979
Colonna, F.P.; Distefano, G.; Guerra, M.; Jones, D.; Modelli, A.,
Furyl- and thienyl-mercury derivatives studied by means of ultraviolet photoelectron spectroscopy. Evidence for the participation in bonding of the vacant 6p π orbitals of mercury in bis-2-furyl-bis-2-thienylmercury,
J. Chem. Soc. Dalton Trans., 1979, 2037. [all data]
Shimoda and Shibamoto, 1990
Shimoda, M.; Shibamoto, T.,
Isolation and identification of headspace volatiles from brewed coffee with an on-column GC/MS method,
J. Agric. Food Chem., 1990, 38, 3, 802-804, https://doi.org/10.1021/jf00093a045
. [all data]
Helmig, Klinger, et al., 1999
Helmig, D.; Klinger, L.F.; Guenther, A.; Vierling, L.; Geron, C.; Zimmerman, P.,
Biogenic volatile organic compound emissions (BVOCs). I. Identifications from three continental sites in the U.S.,
Chemosphere, 1999, 38, 9, 2163-2187, https://doi.org/10.1016/S0045-6535(98)00425-1
. [all data]
Moon, Cliff, et al., 2006
Moon, S.-Y.; Cliff, M.A.; Li-Chan, E.C.Y.,
Odour-active components of simulated beef flavour analysed by solid phase microextraction and gas chromatography-mass spectrometry and -olfactometry,
Food Res. Int., 2006, 39, 3, 294-308, https://doi.org/10.1016/j.foodres.2005.08.002
. [all data]
Baltes w. and Bochmann G., 1987
Baltes w.; Bochmann G.,
Model reactions on roast aroma formation. II. Mass spectrometric identification of furans and furanones from the reaction of serine and threonine with sucrose under the conditions of coffee roasting,
Z. Lebensm. Unters. Forsch., 1987, 184, 179-186. [all data]
Leffingwell and Alford, 2005
Leffingwell, J.C.; Alford, E.D.,
Volatile constituents of Perique tobacco,
Electron. J. Environ. Agric. Food Chem., 2005, 4, 2, 899-915. [all data]
Baraldi, Rapparini, et al., 1999
Baraldi, R.; Rapparini, F.; Rossi, F.; Latella, A.; Ciccioli, P.,
Volatile organic compound emissions from flowers of the most occurring and economically important species of fruit trees,
Phys. Chem. Earth, 1999, 24, 6, 729-732, https://doi.org/10.1016/S1464-1909(99)00073-8
. [all data]
Barrefors, Björkqvist, et al., 1996
Barrefors, G.; Björkqvist, S.; Ramnäs, O.; Petersson, G.,
Gas chromatographic separation of volatile furans from birchwood smoke,
J. Chromatogr. A, 1996, 753, 1, 151-155, https://doi.org/10.1016/S0021-9673(96)00534-1
. [all data]
Vinogradov, 2004
Vinogradov, B.A.,
Production, composition, properties and application of essential oils, 2004, retrieved from http://viness.narod.ru. [all data]
Begnaud, Pérès, et al., 2003
Begnaud, F.; Pérès, C.; Berdagué, J.-L.,
Characterization of volatile effluents of livestock buildings by solid-phase microextraction,
Int. J. Environ. Anal. Chem., 2003, 83, 10, 837-849, https://doi.org/10.1080/03067310310001603349
. [all data]
Ciccioli, Cecinato, et al., 1994
Ciccioli, P.; Cecinato, A.; Brancaleoni, E.; Brachetti, A.; Frattoni, M.; Sparapani, R.,
Composition and Distribution of Polar and Non-Polar VOCs in Urban, Rural, Forest and Remote Areas,
Eur Commission EUR, 1994, 549-568. [all data]
Ciccioli, Brancaleoni, et al., 1993
Ciccioli, P.; Brancaleoni, E.; Cecinato, A.; Sparapani, R.; Frattoni, M.,
Identification and determination of biogenic and anthropogenic volatile organic compounds in forest areas of Northern and Southern Europe and a remote site of the Himalaya region by high-resolution gas chromatography-mass spectrometry,
J. Chromatogr., 1993, 643, 1-2, 55-69, https://doi.org/10.1016/0021-9673(93)80541-F
. [all data]
Takeoka, Flath, et al., 1988
Takeoka, G.R.; Flath, R.A.; Güntert, M.; Jennings, W.,
Nectarine volatiles: vacuum steam distillation versus headspace sampling,
J. Agric. Food Chem., 1988, 36, 3, 553-560, https://doi.org/10.1021/jf00081a037
. [all data]
Sanz, Maeztu, et al., 2002
Sanz, C.; Maeztu, L.; Zapelena, M.J.; Bello, J.; Cid, C.,
Profiles of volatile compounds and sensory analysis of three blends of coffee: influence of different proportions of Arabica and Robusta and influence of roasting coffee with sugar,
J. Sci. Food Agric., 2002, 82, 8, 840-847, https://doi.org/10.1002/jsfa.1110
. [all data]
Maeztu, Sanz, et al., 2001
Maeztu, L.; Sanz, C.; Andueza, S.; de Peña, M.P.; Bello, J.; Cid, C.,
Characterization of espresso coffee aroma by static headspace GC-MS and sensory flavor profile,
J. Agric. Food Chem., 2001, 49, 11, 5437-5444, https://doi.org/10.1021/jf0107959
. [all data]
Sanz, Ansorena, et al., 2001
Sanz, C.; Ansorena, D.; Bello, J.; Cid, C.,
Optimizing headspace temperature and time sampling for identification of volatile compounds in ground roasted Arabica coffee,
J. Agric. Food Chem., 2001, 49, 3, 1364-1369, https://doi.org/10.1021/jf001100r
. [all data]
Girard and Durance, 2000
Girard, B.; Durance, T.,
Headspace volatiles of sockeye and pink salmon as affected by retort process,
Food Chem. Toxicol., 2000, 65, 1, 34-39. [all data]