2-Azetidinone
- Formula: C3H5NO
- Molecular weight: 71.0779
- IUPAC Standard InChIKey: MNFORVFSTILPAW-UHFFFAOYSA-N
- CAS Registry Number: 930-21-2
- Chemical structure:
View 3d structure (requires JavaScript / HTML 5) - Permanent link for this species. Use this link for bookmarking this species for future reference.

Gas phase thermochemistry data

Data compiled by: Hussein Y. Afeefy, Joel F. Liebman, and Stephen E. Stein
Quantity | Value | Units | Method | Reference | Comment |
---|---|---|---|---|---|
ΔfH°gas | -96.0 ± 0.9 | kJ/mol | Ccb | Roux, Jimenez, et al., 1996 |

Condensed phase thermochemistry data

Data compiled by: Hussein Y. Afeefy, Joel F. Liebman, and Stephen E. Stein
Quantity | Value | Units | Method | Reference | Comment |
---|---|---|---|---|---|
ΔfH°solid | -173.4 ± 0.9 | kJ/mol | Ccb | Roux, Jimenez, et al., 1996 | |
Quantity | Value | Units | Method | Reference | Comment |
ΔcH°solid | -1721.7 ± 0.8 | kJ/mol | Ccb | Roux, Jimenez, et al., 1996 |

Phase change data

Data compiled as indicated in comments:
BS - Robert L. Brown and Stephen E. Stein
ALS - Hussein Y. Afeefy, Joel F. Liebman, and Stephen E. Stein
AC - William E. Acree, Jr., James S. Chickos
Quantity | Value | Units | Method | Reference | Comment |
---|---|---|---|---|---|
Tfus | 346. to 347. | K | N/A | Buckingham and Donaghy, 1982 | BS |
Quantity | Value | Units | Method | Reference | Comment |
ΔsubH° | 77.4 ± 0.3 | kJ/mol | V | Roux, Jimenez, et al., 1996 | ALS |
ΔsubH° | 77.4 ± 0.3 | kJ/mol | ME | Roux, Jimenez, et al., 1996 | AC |
Reduced pressure boiling point
Tboil (K) | Pressure (bar) | Reference | Comment |
---|---|---|---|
379.2 | 0.020 | Weast and Grasselli, 1989 | BS |
379. | 0.020 | Buckingham and Donaghy, 1982 | BS |

Gas phase ion energetics data

Data evaluated as indicated in comments:
HL - Edward P. Hunter and Sharon G. Lias
Data compiled as indicated in comments:
LBLHLM - Sharon G. Lias, John E. Bartmess, Joel F. Liebman, John L. Holmes, Rhoda D. Levin, and W. Gary Mallard
Quantity | Value | Units | Method | Reference | Comment |
---|---|---|---|---|---|
Proton affinity (review) | 852.6 | kJ/mol | N/A | Hunter and Lias, 1998 | HL |
Quantity | Value | Units | Method | Reference | Comment |
Gas basicity | 821.7 | kJ/mol | N/A | Hunter and Lias, 1998 | HL |
Ionization energy determinations
IE (eV) | Method | Reference | Comment |
---|---|---|---|
9.78 | PE | Treschanke and Rademacher, 1985 | LBLHLM |

References

Roux, Jimenez, et al., 1996
Roux, M.V.; Jimenez, P.; Davalos, J.Z.; Castano, O.; Molina, M.T.; Notario, R.; Herreros, M.; Abboud, J.-L.M.,
The first direct experimental determination of strain in neutral and protonated 2-azetidinone,
J. Am. Chem. Soc., 1996, 118, 12735-12737. [all data]
Buckingham and Donaghy, 1982
Buckingham, J.; Donaghy, S.M.,
Dictionary of Organic Compounds: Fifth Edition, Chapman and Hall, New York, 1982, 1. [all data]
Weast and Grasselli, 1989
CRC Handbook of Data on Organic Compounds, 2nd Editon, Weast,R.C and Grasselli, J.G., ed(s)., CRC Press, Inc., Boca Raton, FL, 1989, 1. [all data]
Hunter and Lias, 1998
Hunter, E.P.; Lias, S.G.,
Evaluated Gas Phase Basicities and Proton Affinities of Molecules: An Update,
J. Phys. Chem. Ref. Data, 1998, 27, 3, 413-656, https://doi.org/10.1063/1.556018
. [all data]
Treschanke and Rademacher, 1985
Treschanke, L.; Rademacher, P.,
Electronic structure and conformational properties of the amide linkage,
J. Mol. Struct., 1985, 122, 47. [all data]