Cyclopropane, 1,2-dimethyl-, cis-
- Formula: C5H10
- Molecular weight: 70.1329
- IUPAC Standard InChIKey: VKJLDXGFBJBTRQ-SYDPRGILSA-N
- CAS Registry Number: 930-18-7
- Chemical structure:
View 3d structure (requires JavaScript / HTML 5) - Stereoisomers:
- Other names: cis-1,2-Dimethylcyclopropane; 1,cis-2-Dimethylcyclopropane; c-1,2-Dimethylcyclopropane

Gas phase thermochemistry data

Data compiled by: Glushko Thermocenter, Russian Academy of Sciences, Moscow
Constant pressure heat capacity of gas
Cp,gas (J/mol*K) | Temperature (K) | Reference | Comment |
---|---|---|---|
35.91 | 50. | Thermodynamics Research Center, 1997 | p=1 bar. |
49.40 | 100. | ||
62.47 | 150. | ||
74.98 | 200. | ||
95.47 | 273.15 | ||
103.05 | 298.15 | ||
103.62 | 300. | ||
134.22 | 400. | ||
161.86 | 500. | ||
185.36 | 600. | ||
205.24 | 700. | ||
222.23 | 800. | ||
236.86 | 900. | ||
249.50 | 1000. | ||
260.45 | 1100. | ||
269.95 | 1200. | ||
278.18 | 1300. | ||
285.34 | 1400. | ||
291.57 | 1500. | ||
303.9 | 1750. | ||
312.9 | 2000. | ||
319.6 | 2250. | ||
324.6 | 2500. | ||
328.4 | 2750. | ||
331.4 | 3000. |

Condensed phase thermochemistry data

Data compiled by: Hussein Y. Afeefy, Joel F. Liebman, and Stephen E. Stein
Quantity | Value | Units | Method | Reference | Comment |
---|---|---|---|---|---|
ΔfH°liquid | -26.3 ± 0.67 | kJ/mol | Ccb | Good, 1971 | |
Quantity | Value | Units | Method | Reference | Comment |
ΔcH°liquid | -3370.4 ± 0.59 | kJ/mol | Ccb | Good, 1971 | Corresponding ΔfHºliquid = -26.3 kJ/mol (simple calculation by NIST; no Washburn corrections) |

Phase change data

Data compiled as indicated in comments:
BS - Robert L. Brown and Stephen E. Stein
TRC - Thermodynamics Research Center, NIST Boulder Laboratories, Chris Muzny director
Quantity | Value | Units | Method | Reference | Comment |
---|---|---|---|---|---|
Tboil | 309. ± 3. | K | AVG | N/A | Average of 7 values; Individual data points |
Quantity | Value | Units | Method | Reference | Comment |
Tfus | 132.2 ± 0.1 | K | AVG | N/A | Average of 10 out of 11 values; Individual data points |

Reaction thermochemistry data

Data compiled by: Hussein Y. Afeefy, Joel F. Liebman, and Stephen E. Stein
Individual Reactions
Quantity | Value | Units | Method | Reference | Comment |
---|---|---|---|---|---|
ΔrH° | -160.3 ± 0.50 | kJ/mol | Chyd | Turner, Goebel, et al., 1968 | liquid phase; solvent: Acetic acid |
ΔrH° | -159. ± 4.2 | kJ/mol | Chyd | Chesick, 1963 | liquid phase; solvent: Acetic acid |

Gas phase ion energetics data

Data compiled as indicated in comments:
RDSH - Henry M. Rosenstock, Keith Draxl, Bruce W. Steiner, and John T. Herron
Ionization energy determinations
IE (eV) | Method | Reference | Comment |
---|---|---|---|
9.76 ± 0.02 | EI | Natalis and Laune, 1964 | RDSH |
Appearance energy determinations
Ion | AE (eV) | Other Products | Method | Reference | Comment |
---|---|---|---|---|---|
C3H6+ | 11.26 | C2H4 | EI | Natalis and Laune, 1964 | RDSH |
C4H7+ | 11.32 ± 0.03 | CH3 | EI | Natalis and Laune, 1964 | RDSH |

Kovats' RI, non-polar column, isothermal

Column type | Active phase | Temperature (C) | I | Reference | Comment |
---|---|---|---|---|---|
Packed | Squalane | 20. | 513. | Bogoslovsky, Anvaer, et al., 1978 | |
Packed | Squalane | 27. | 514. | Bogoslovsky, Anvaer, et al., 1978 | |
Packed | Squalane | 50. | 515. | Bogoslovsky, Anvaer, et al., 1978 | |
Packed | Squalane | 67. | 517. | Bogoslovsky, Anvaer, et al., 1978 | |
Packed | Squalane | 70. | 516. | Bogoslovsky, Anvaer, et al., 1978 | |
Packed | Squalane | 86. | 518. | Bogoslovsky, Anvaer, et al., 1978 | |
Packed | Squalane | 90. | 519. | Bogoslovsky, Anvaer, et al., 1978 | |
Capillary | Squalane | 50. | 516. | Rijks and Cramers, 1974 | N2; Column length: 100. m; Column diameter: 0.25 mm |
Capillary | Squalane | 70. | 516. | Rijks and Cramers, 1974 | N2; Column length: 100. m; Column diameter: 0.25 mm |
Capillary | Squalane | 120. | 513.1 | Schomburg and Dielmann, 1973 | Column length: 100. m; Column diameter: 0.25 mm |
Packed | Squalane | 27. | 514. | Hively and Hinton, 1968 | He, Chromosorb P; Column length: 15. m; Column diameter: 0.25 mm |
Packed | Squalane | 49. | 516. | Hively and Hinton, 1968 | He, Chromosorb P; Column length: 15. m; Column diameter: 0.25 mm |
Packed | Squalane | 67. | 517. | Hively and Hinton, 1968 | He, Chromosorb P; Column length: 15. m; Column diameter: 0.25 mm |
Packed | Squalane | 86. | 518. | Hively and Hinton, 1968 | He, Chromosorb P; Column length: 15. m; Column diameter: 0.25 mm |

Van Den Dool and Kratz RI, non-polar column, temperature ramp

Column type | Active phase | I | Reference | Comment |
---|---|---|---|---|
Capillary | DB-5 | 515.8 | Xu, van Stee, et al., 2003 | 30. m/0.25 mm/1. μm, He, 2.5 K/min; Tstart: 50. C; Tend: 200. C |

Normal alkane RI, non-polar column, isothermal

Column type | Active phase | Temperature (C) | I | Reference | Comment |
---|---|---|---|---|---|
Capillary | Methyl Silicone | 50. | 515. | N/A | N2; Column length: 74.6 m; Column diameter: 0.28 mm |

Normal alkane RI, non-polar column, custom temperature program

Column type | Active phase | I | Reference | Comment |
---|---|---|---|---|
Capillary | Polydimethyl siloxanes | 517. | Zenkevich, Chupalov, et al., 1996 | Program: not specified |
Capillary | Methyl Silicone | 515. | Zenkevich, 1996 | Program: not specified |

References

Thermodynamics Research Center, 1997
Thermodynamics Research Center,
Selected Values of Properties of Chemical Compounds., Thermodynamics Research Center, Texas A&M University, College Station, Texas, 1997. [all data]
Good, 1971
Good, W.D.,
The enthalpies of combustion and formation of some alkyl cyclopropanes,
J. Chem. Thermodyn., 1971, 3, 539-546. [all data]
Turner, Goebel, et al., 1968
Turner, R.B.; Goebel, P.; Mallon, B.J.; Doering, W.E.; Coburn, J.F., Jr.; Pomerantz, M.,
Heats of hydrogenation. VIII. Compounds with three- and four-membered rings,
J. Am. Chem. Soc., 1968, 90, 4315-4322. [all data]
Chesick, 1963
Chesick, J.P.,
Kinetics of the thermal interconversion of 2-methylmethylenecyclopropane and ethylidenecyclopropane,
J. Am. Chem. Soc., 1963, 85, 2720-2723. [all data]
Natalis and Laune, 1964
Natalis, P.; Laune, J.,
Etude du comportement d'isomeres geometriques sous l'impact electronique. IV. Cyclopropane, methylcyclopropane et dimethylcyclopropanes gem. cis et trans,
Bull. Soc. Chim. Belges, 1964, 73, 944. [all data]
Bogoslovsky, Anvaer, et al., 1978
Bogoslovsky, Yu.N.; Anvaer, B.I.; Vigdergauz, M.S.,
Chromatographic constants in gas chromatography (in Russian), Standards Publ. House, Moscow, 1978, 192. [all data]
Rijks and Cramers, 1974
Rijks, J.A.; Cramers, C.A.,
High precision capillary gas chromatography of hydrocarbons,
Chromatographia, 1974, 7, 3, 99-106, https://doi.org/10.1007/BF02269819
. [all data]
Schomburg and Dielmann, 1973
Schomburg, G.; Dielmann, G.,
Use of retention increments for identification and correlation of saturated and unsaturated cyclopropane hydrocarbons by means of Kovats indices,
Anal. Chem., 1973, 45, 9, 1647-1658, https://doi.org/10.1021/ac60331a021
. [all data]
Hively and Hinton, 1968
Hively, R.A.; Hinton, R.E.,
Variation of the retention index with temperature on squalane substrates,
J. Gas Chromatogr., 1968, 6, 4, 203-217, https://doi.org/10.1093/chromsci/6.4.203
. [all data]
Xu, van Stee, et al., 2003
Xu, X.; van Stee, L.L.P.; Williams, J.; Beens, J.; Adahchour, M.; Vreuls, R.J.J.; Brinkman, U.A.Th.; Lelieveld, J.,
Comprehensive two-dimensional gas chromatography (GC×GC) measurements of volatile organic compounds in the atmosphere,
Atmos. Chem. Phys., 2003, 3, 3, 665-682, https://doi.org/10.5194/acp-3-665-2003
. [all data]
Zenkevich, Chupalov, et al., 1996
Zenkevich, I.G.; Chupalov, A.A.; Herzschuh, R.,
Correlation of the Increments of Gas Chromatographic Retention Indices with the Differences of Innermolecular Energies of Reagents and Products of Chemical Reactions,
Zh. Org. Khim. (Rus.), 1996, 32, 11, 1685-1691. [all data]
Zenkevich, 1996
Zenkevich, I.G.,
Informational Maitenance of Gas Chromatographic Identification of Organic Compounds in Ecoanalytical Investigations,
Z. Anal. Chem., 1996, 51, 11, 1140-1148. [all data]