p-Terphenyl
- Formula: C18H14
- Molecular weight: 230.3038
- IUPAC Standard InChIKey: XJKSTNDFUHDPQJ-UHFFFAOYSA-N
- CAS Registry Number: 92-94-4
- Chemical structure:
- Other names: 1,1':4',1''-Terphenyl; p-Diphenylbenzene; p-Triphenyl; Santowax P; 1,1'-Biphenyl, 4-phenyl-; 1,4-Diphenylbenzene; 4-Phenylbiphenyl; 4-Phenyldiphenyl; Biphenyl, 4-phenyl-; NSC 6810; PT; PTP

Gas phase thermochemistry data

Data compiled as indicated in comments:
DRB - Donald R. Burgess, Jr.
ALS - Hussein Y. Afeefy, Joel F. Liebman, and Stephen E. Stein
Quantity | Value | Units | Method | Reference | Comment |
---|---|---|---|---|---|
ΔfH°gas | 284.4 ± 3.8 | kJ/mol | Review | Roux, Temprado, et al., 2008 | There are sufficient literature values to make a qualified recommendation where the suggested value is in good agreement with values predicted using thermochemical cycles or from reliable estimates. In general, the evaluated uncertainty limits are on the order of (2 to 4) kJ/mol.; DRB |
ΔfH°gas | 279. ± 6.3 | kJ/mol | Ccb | Balepin, Lebedev, et al., 1977 | ALS |

Phase change data

Data compiled as indicated in comments:
BS - Robert L. Brown and Stephen E. Stein
TRC - Thermodynamics Research Center, NIST Boulder Laboratories, Chris Muzny director
AC - William E. Acree, Jr., James S. Chickos
DRB - Donald R. Burgess, Jr.
ALS - Hussein Y. Afeefy, Joel F. Liebman, and Stephen E. Stein
DH - Eugene S. Domalski and Elizabeth D. Hearing
Quantity | Value | Units | Method | Reference | Comment |
---|---|---|---|---|---|
Tboil | 662.2 | K | N/A | Aldrich Chemical Company Inc., 1990 | BS |
Quantity | Value | Units | Method | Reference | Comment |
Tfus | 493.1 | K | N/A | Wasicki, Radomska, et al., 1982 | Uncertainty assigned by TRC = 0.2 K; TRC |
Tfus | 487.5 | K | N/A | Sangster and Irvine, 1956 | Uncertainty assigned by TRC = 5. K; TRC |
Tfus | 488.1 | K | N/A | Sangster and Irvine, 1956 | Uncertainty assigned by TRC = 4. K; TRC |
Tfus | 486. | K | N/A | Mikhailov and Aronovich, 1955 | Uncertainty assigned by TRC = 3. K; TRC |
Tfus | 480. | K | N/A | Ipatieff, Germain, et al., 1953 | Uncertainty assigned by TRC = 3. K; TRC |
Quantity | Value | Units | Method | Reference | Comment |
Ttriple | 487.0 | K | N/A | Chang, 1983 | Crystal phase 1 phase; Uncertainty assigned by TRC = 0.2 K; TRC |
Quantity | Value | Units | Method | Reference | Comment |
Tc | 908. ± 10. | K | N/A | Tsonopoulos and Ambrose, 1995 | |
Tc | 908. | K | N/A | Reiter, 1963 | Uncertainty assigned by TRC = 10. K; TRC |
Tc | 925.9 | K | N/A | Mandel and Ewbank, 1960 | Uncertainty assigned by TRC = 16.7 K; TRC |
Quantity | Value | Units | Method | Reference | Comment |
Pc | 30. ± 6. | bar | N/A | Tsonopoulos and Ambrose, 1995 | |
Pc | 29.90 | bar | N/A | Reiter, 1963 | Uncertainty assigned by TRC = 6.0795 bar; TRC |
Pc | 33.30 | bar | N/A | Mandel and Ewbank, 1960 | Uncertainty assigned by TRC = 3.447 bar; TRC |
Quantity | Value | Units | Method | Reference | Comment |
Vc | 0.729 | l/mol | N/A | Tsonopoulos and Ambrose, 1995 | |
Quantity | Value | Units | Method | Reference | Comment |
ρc | 1.4 ± 0.6 | mol/l | N/A | Tsonopoulos and Ambrose, 1995 | |
ρc | 1.37 | mol/l | N/A | Reiter, 1963 | Uncertainty assigned by TRC = 0.087 mol/l; TRC |
ρc | 1.31 | mol/l | N/A | Mandel and Ewbank, 1960 | Uncertainty assigned by TRC = 0.13 mol/l; TRC |
Quantity | Value | Units | Method | Reference | Comment |
ΔvapH° | 101.7 | kJ/mol | CGC | Zhao, Unhannanant, et al., 2008 | AC |
Quantity | Value | Units | Method | Reference | Comment |
ΔsubH° | 119. ± 9. | kJ/mol | AVG | N/A | Average of 7 values; Individual data points |
Enthalpy of vaporization
ΔvapH (kJ/mol) | Temperature (K) | Method | Reference | Comment |
---|---|---|---|---|
79.2 | 398. | GC | Lei, Chankalal, et al., 2002 | Based on data from 323. to 473. K.; AC |
79.2 | 514. | A | Stephenson and Malanowski, 1987 | Based on data from 499. to 700. K.; AC |
Enthalpy of sublimation
ΔsubH (kJ/mol) | Temperature (K) | Method | Reference | Comment |
---|---|---|---|---|
116.2 ± 2.4 | 368. | T | Verevkin, 1997 | Based on data from 353. to 383. K.; AC |
118.4 | 397. | ME | Wakayama and Inokuchi, 1967 | AC |
120.6 | 363. | N/A | Hoyer and Peperle, 1958 | Based on data from 333. to 393. K.; AC |
Enthalpy of fusion
ΔfusH (kJ/mol) | Temperature (K) | Method | Reference | Comment |
---|---|---|---|---|
35.300 | 487.0 | N/A | Chang, 1983, 2 | DH |
35.500 | 486.3 | N/A | Smith, 1979 | DH |
41.600 | 493.1 | N/A | Wasicki, Radomska, et al., 1982, 2 | DH |
35.3 | 482.4 | DSC | Verevkin, 1997 | AC |
35.5 | 486.3 | N/A | Saito, Atake, et al., 1988 | See also Chang, 1983 and Acree, 1991.; AC |
Entropy of fusion
ΔfusS (J/mol*K) | Temperature (K) | Reference | Comment |
---|---|---|---|
72.5 | 487.0 | Chang, 1983, 2 | DH |
73.0 | 486.3 | Smith, 1979 | DH |
84.4 | 493.1 | Wasicki, Radomska, et al., 1982, 2 | DH |
Temperature of phase transition
Ttrs (K) | Initial Phase | Final Phase | Reference | Comment |
---|---|---|---|---|
193.55 | crystaline, II | crystaline, I | Chang, 1983, 2 | Lambda transition.; DH |
Enthalpy of phase transition
ΔHtrs (kJ/mol) | Temperature (K) | Initial Phase | Final Phase | Reference | Comment |
---|---|---|---|---|---|
0.304 | 193.5 | crystaline, II | crystaline, I | Saito, Atake, et al., 1988 | DH |
0.095 | 193.3 | crystaline, II | crystaline, I | Cailleau and Dworkin, 1979 | Obtained T = 191.0 K, S = 0.45 J/mol, from DSC data.; DH |
Entropy of phase transition
ΔStrs (J/mol*K) | Temperature (K) | Initial Phase | Final Phase | Reference | Comment |
---|---|---|---|---|---|
1.63 | 193.5 | crystaline, II, Lambda | crystaline, I, type transition | Saito, Atake, et al., 1988 | DH |
0.49 | 193.3 | crystaline, II | crystaline, I | Cailleau and Dworkin, 1979 | Obtained; DH |

Gas phase ion energetics data

Data evaluated as indicated in comments:
L - Sharon G. Lias
Data compiled as indicated in comments:
LLK - Sharon G. Lias, Rhoda D. Levin, and Sherif A. Kafafi
RDSH - Henry M. Rosenstock, Keith Draxl, Bruce W. Steiner, and John T. Herron
Quantity | Value | Units | Method | Reference | Comment |
---|---|---|---|---|---|
IE (evaluated) | 7.80 ± 0.03 | eV | N/A | N/A | L |
Ionization energy determinations
IE (eV) | Method | Reference | Comment |
---|---|---|---|
7.83 | PE | Hino, Seki, et al., 1975 | LLK |
7.78 ± 0.01 | PE | Dewar and Goodman, 1972 | LLK |
8.29 | CTS | Slifkin and Allison, 1967 | RDSH |
8.78 ± 0.05 | EI | Gallegos, 1967 | RDSH |

Kovats' RI, non-polar column, custom temperature program

Column type | Active phase | I | Reference | Comment |
---|---|---|---|---|
Packed | SE-30 | 2208. | Ramsey, Lee, et al., 1980 | He, Chromosorb G HP (80-100 mesh); Column length: 1.5 m; Program: not specified |

Van Den Dool and Kratz RI, non-polar column, temperature ramp

Column type | Active phase | I | Reference | Comment |
---|---|---|---|---|
Capillary | DB-5 | 2190.9 | Song, Lai, et al., 2003 | 30. m/0.25 mm/0.25 μm, He, 4. K/min; Tstart: 40. C; Tend: 310. C |
Capillary | DB-5 | 2190.9 | Song, Lai, et al., 2003 | 30. m/0.25 mm/0.25 μm, He, 40. C @ 5. min, 4. K/min; Tend: 310. C |
Capillary | DB-5 | 2171.1 | Song, Lai, et al., 2003 | 30. m/0.25 mm/0.25 μm, He, 2. K/min; Tstart: 40. C; Tend: 310. C |
Capillary | DB-5 | 2190.9 | Song, Lai, et al., 2003 | 30. m/0.25 mm/0.25 μm, He, 4. K/min; Tstart: 40. C; Tend: 310. C |
Capillary | DB-5 | 2204.0 | Song, Lai, et al., 2003 | 30. m/0.25 mm/0.25 μm, He, 6. K/min; Tstart: 40. C; Tend: 310. C |
Capillary | DB-5 | 2171.1 | Lai and Song, 1995 | 30. m/0.25 mm/0.25 μm, He, 2. K/min; Tstart: 40. C; Tend: 310. C |
Capillary | DB-5 | 2190.9 | Lai and Song, 1995 | 30. m/0.25 mm/0.25 μm, He, 4. K/min; Tstart: 40. C; Tend: 310. C |
Capillary | DB-5 | 2204. | Lai and Song, 1995 | 30. m/0.25 mm/0.25 μm, He, 6. K/min; Tstart: 40. C; Tend: 310. C |
Capillary | DB-5 | 2190.9 | Lai and Song, 1995 | 30. m/0.25 mm/0.25 μm, He, 4. K/min; Tstart: 40. C; Tend: 310. C |
Capillary | DB-5 | 2190.9 | Lai and Song, 1995 | 30. m/0.25 mm/0.25 μm, He, 40. C @ 5. min, 4. K/min; Tend: 310. C |
Capillary | DB-5 | 2208. | Rostad and Pereira, 1986 | 30. m/0.26 mm/0.25 μm, He, 50. C @ 4. min, 6. K/min, 300. C @ 20. min |
Capillary | SE-30 | 2208. | Korhonen and Lind, 1985 | N2, 10. K/min; Column length: 25. m; Column diameter: 0.33 mm; Tstart: 100. C; Tend: 320. C |
Capillary | SE-30 | 2208. | Korhonen and Lind, 1985 | N2, 6. K/min; Column length: 25. m; Column diameter: 0.33 mm; Tstart: 140. C; Tend: 320. C |

Normal alkane RI, non-polar column, custom temperature program

Column type | Active phase | I | Reference | Comment |
---|---|---|---|---|
Other | Methyl Silicone | 2208. | Ardrey and Moffat, 1981 | Program: not specified |

Normal alkane RI, polar column, custom temperature program

Column type | Active phase | I | Reference | Comment |
---|---|---|---|---|
Capillary | DB-Wax | 3129. | Peng, Yang, et al., 1991 | Program: not specified |

Lee's RI, non-polar column, temperature ramp

Column type | Active phase | I | Reference | Comment |
---|---|---|---|---|
Capillary | HP-5 | 350.2 | Wang, Hou, et al., 2007 | 30. m/0.30 mm/0.25 μm, Helium, 50. C @ 5. min, 5. K/min, 200. C @ 15. min |
Capillary | HP-5 | 362.4 | Marynowski, Pieta, et al., 2004 | 60. m/0.25 mm/0.25 μm, He, 3. K/min; Tstart: 35. C; Tend: 300. C |
Capillary | HP-5 | 363.98 | Piao, Chu, et al., 1999 | 30. m/0.25 mm/0.25 μm, 50. C @ 2. min, 4. K/min, 280. C @ 20. min |
Capillary | DB-5 | 357.6 | Durlak, Biswas, et al., 1998 | 30. m/0.25 mm/0.25 μm, 15. K/min; Tstart: 50. C; Tend: 300. C |
Capillary | DB-5 | 357.6 | Durlak, Biswas, et al., 1998 | 30. m/0.25 mm/0.25 μm, 15. K/min; Tstart: 50. C; Tend: 300. C |
Capillary | DB-5 | 362.29 | Rostad and Pereira, 1986 | 30. m/0.26 mm/0.25 μm, He, 50. C @ 4. min, 6. K/min, 300. C @ 20. min |
Capillary | SE-52 | 366.10 | Lee, Vassilaros, et al., 1979 | 12. m/0.3 mm/0.34 μm, He, 2. K/min; Tstart: 50. C; Tend: 250. C |

Lee's RI, non-polar column, custom temperature program

Column type | Active phase | I | Reference | Comment |
---|---|---|---|---|
Capillary | HP-5MS | 357.65 | Wang, Li, et al., 2007 | 30. m/0.25 mm/0.25 μm, He; Program: 60C(2min) => 6C/min => 258C => 2C/min => 300C(4min) |
Capillary | HP-5MS | 357.65 | Wang, Li, et al., 2007, 2 | 30. m/0.25 mm/0.25 μm, He; Program: not specified |
Capillary | SE-52 | 362.61 | Shlyakhov, 1984 | Program: not specified |
Capillary | SE-52 | 366.10 | Shlyakhov, 1984 | Program: not specified |

Condensed phase thermochemistry data

Data compiled as indicated in comments:
DRB - Donald R. Burgess, Jr.
ALS - Hussein Y. Afeefy, Joel F. Liebman, and Stephen E. Stein
DH - Eugene S. Domalski and Elizabeth D. Hearing
Quantity | Value | Units | Method | Reference | Comment |
---|---|---|---|---|---|
ΔfH°solid | 158.8 ± 3.4 | kJ/mol | Review | Roux, Temprado, et al., 2008 | There are sufficient literature values to make a qualified recommendation where the suggested value is in good agreement with values predicted using thermochemical cycles or from reliable estimates. In general, the evaluated uncertainty limits are on the order of (2 to 4) kJ/mol.; DRB |
ΔfH°solid | 163. ± 4.6 | kJ/mol | Ccb | Balepin, Lebedev, et al., 1977 | ALS |
Quantity | Value | Units | Method | Reference | Comment |
ΔcH°solid | -9246.6 ± 4.6 | kJ/mol | Ccb | Balepin, Lebedev, et al., 1977 | Corresponding ΔfHºsolid = 163. kJ/mol (simple calculation by NIST; no Washburn corrections); ALS |
Quantity | Value | Units | Method | Reference | Comment |
S°solid,1 bar | 285.23 | J/mol*K | N/A | Saito, Atake, et al., 1988 | crystaline, I phase; DH |
S°solid,1 bar | 285.62 | J/mol*K | N/A | Chang, 1983 | DH |
Constant pressure heat capacity of solid
Cp,solid (J/mol*K) | Temperature (K) | Reference | Comment |
---|---|---|---|
278.12 | 298.15 | Saito, Atake, et al., 1988 | crystaline, I phase; T = 5 to 300 K.; DH |
278.68 | 298.15 | Chang, 1983 | T = 4 to 580 K. Cp = 35.12 + 0.58825T + 0.0010062T2 - 8.042x10-7T3 from 80 to 300 K.; DH |
260. | 300. | Wasicki, Radomska, et al., 1982 | T = 180 to 500 K. Data given graphically. Value estimated from graph.; DH |

References

Roux, Temprado, et al., 2008
Roux, M.V.; Temprado, M.; Chickos, J.S.; Nagano, Y.,
Critically Evaluated Thermochemical Properties of Polycyclic Aromatic Hydrocarbons,
J. Phys. Chem. Ref. Data, 2008, 37, 4, 1855-1996. [all data]
Balepin, Lebedev, et al., 1977
Balepin, A.A.; Lebedev, V.P.; Miroshnichenko, E.A.; Koldobskii, G.I.; Ostovskii, V.A.; Larionov, B.P.; Gidaspov, B.V.; Lebedev, Yu.A.,
Energy effects in polyphenylenes and phenyltetrazoles,
Svoistva Veshchestv Str. Mol., 1977, 93-98. [all data]
Aldrich Chemical Company Inc., 1990
Aldrich Chemical Company Inc.,
Catalog Handbook of Fine Chemicals, Aldrich Chemical Company, Inc., Milwaukee WI, 1990, 1. [all data]
Wasicki, Radomska, et al., 1982
Wasicki, J.; Radomska, M.; Radomski, R.,
Heat capacities of diphenyl, p-terphenyl and p-quaterphenyl from 180 K to their melting points,
J. Therm. Anal., 1982, 25, 509. [all data]
Sangster and Irvine, 1956
Sangster, R.C.; Irvine, J.W.,
Study of Organic Scintillators,
J. Chem. Phys., 1956, 24, 670. [all data]
Mikhailov and Aronovich, 1955
Mikhailov, B.M.; Aronovich, P.M.,
Preparation of p-terphenyl,
Izv. Akad. Nauk SSSR, 1955, 1955, 945. [all data]
Ipatieff, Germain, et al., 1953
Ipatieff, V.N.; Germain, J.E.; Pines, H.,
The Structure of Di-(methylcyclohexyl)-benzene from Cycloalkylation of 4-Methylcyclohexane with Benzene in the Presence of Hydrogen Fluoride,
J. Am. Chem. Soc., 1953, 75, 6056. [all data]
Chang, 1983
Chang, Shu-Sing,
Heat capacity and thermodynamic properties of p-terphenyl: Study of order--disorder transition by automated high-resolution adiabatic calorimetry,
J. Chem. Phys., 1983, 79, 12, 6229, https://doi.org/10.1063/1.445727
. [all data]
Tsonopoulos and Ambrose, 1995
Tsonopoulos, C.; Ambrose, D.,
Vapor-Liquid Critical Properties of Elements and Compounds. 3. Aromatic Hydrocarbons,
J. Chem. Eng. Data, 1995, 40, 547-558. [all data]
Reiter, 1963
Reiter, R.W.,
, NASA Doc. N63-19495 1963 1963, 1963. [all data]
Mandel and Ewbank, 1960
Mandel, H.; Ewbank, N.,
, Atomics International NAA-S-R-5129 1960, 1960. [all data]
Zhao, Unhannanant, et al., 2008
Zhao, Hui; Unhannanant, Patamaporn; Hanshaw, William; Chickos, James S.,
Enthalpies of Vaporization and Vapor Pressures of Some Deuterated Hydrocarbons. Liquid-Vapor Pressure Isotope Effects,
J. Chem. Eng. Data, 2008, 53, 7, 1545-1556, https://doi.org/10.1021/je800091s
. [all data]
Lei, Chankalal, et al., 2002
Lei, Ying Duan; Chankalal, Raymond; Chan, Anita; Wania, Frank,
Supercooled Liquid Vapor Pressures of the Polycyclic Aromatic Hydrocarbons,
J. Chem. Eng. Data, 2002, 47, 4, 801-806, https://doi.org/10.1021/je0155148
. [all data]
Stephenson and Malanowski, 1987
Stephenson, Richard M.; Malanowski, Stanislaw,
Handbook of the Thermodynamics of Organic Compounds, 1987, https://doi.org/10.1007/978-94-009-3173-2
. [all data]
Verevkin, 1997
Verevkin, S.P.,
Thermochemistry of substituted benzenes. Experimental standard molar enthalpies of formation of o-, m-, and p-terphenyls and 1,3,5-triphenylbenzene,
J. Chem. Thermodyn., 1997, 29, 1495-1501. [all data]
Wakayama and Inokuchi, 1967
Wakayama, Nobuko; Inokuchi, Hiroo,
Heats of Sublimation of Polycyclic Aromatic Hydrocarbons and Their Molecular Packings,
Bull. Chem. Soc. Jpn., 1967, 40, 10, 2267-2271, https://doi.org/10.1246/bcsj.40.2267
. [all data]
Hoyer and Peperle, 1958
Hoyer, H.; Peperle, W.,
Z. Elektrochem., 1958, 62, 61. [all data]
Chang, 1983, 2
Chang, S.S.,
Heat capacity and thermodynamic properties of p-terphenyl: study of order-disorder transition by automated high-resolution adiabatic calorimetry,
J. Chem. Phys., 1983, 79, 6229-6236. [all data]
Smith, 1979
Smith, G.W.,
Phase behavior of some linear polyphenyls,
Mol. Cryst. Liq. Cryst., 1979, 49, 207-209. [all data]
Wasicki, Radomska, et al., 1982, 2
Wasicki, J.; Radomska, M.; Radomski, R.,
Heat capacities of diphenyl, p-terphenyl and p-quaterphenyl from 180 K to their melting points,
J. Therm. Anal., 1982, 25, 509-514. [all data]
Saito, Atake, et al., 1988
Saito, K.; Atake, T.; Chihara, H.,
Thermodynamic studies on order-disorder phase transitions of p-terphenyl and p-terphenyl-d14,
Bull. Chem. Soc. Japan, 1988, 61, 2327-2336. [all data]
Acree, 1991
Acree, William E.,
Thermodynamic properties of organic compounds: enthalpy of fusion and melting point temperature compilation,
Thermochimica Acta, 1991, 189, 1, 37-56, https://doi.org/10.1016/0040-6031(91)87098-H
. [all data]
Cailleau and Dworkin, 1979
Cailleau, H.; Dworkin, A.,
Calorimetric study of the phase transition of para-terphenyl,
Mol. Cryst. Liq. Cryst., 1979, 50, 217-222. [all data]
Hino, Seki, et al., 1975
Hino, S.; Seki, K.; Inokuchi, H.,
Photoelectron spectra of p-terphenyl in gaseous and solid states,
Chem. Phys. Lett., 1975, 36, 335. [all data]
Dewar and Goodman, 1972
Dewar, M.J.S.; Goodman, D.W.,
Photoelectron spectra of molecules. Part 5.--Polycyclic aromatic hydrocarbons,
J. Chem. Soc. Faraday Trans. 2, 1972, 68, 1784. [all data]
Slifkin and Allison, 1967
Slifkin, M.A.; Allison, A.C.,
Measurement of ionization potentials from contact charge transfer spectra,
Nature, 1967, 215, 949. [all data]
Gallegos, 1967
Gallegos, E.J.,
Mass spectrometry of some polyphenyls,
J. Phys. Chem., 1967, 71, 1647. [all data]
Ramsey, Lee, et al., 1980
Ramsey, J.D.; Lee, T.D.; Osselton, M.D.; Moffat, A.C.,
Gas-liquid chromatographic retention indices of 296 non-drug substances on SE-30 or OV-1 likely to be encountered in toxicological analyses,
J. Chromatogr., 1980, 184, 2, 185-206, https://doi.org/10.1016/S0021-9673(00)85641-1
. [all data]
Song, Lai, et al., 2003
Song, C.; Lai, W.-C.; Madhusudan Reddy, K.; Wei, B.,
Chapter 7. Temperature-programmed retention indices for GC and GC-MS of hydrocarbon fuels and simulated distillation GC of heavy oils
in Analytical advances for hydrocarbon research, Hsu,C.S., ed(s)., Kluwer Academic/Plenum Publishers, New York, 2003, 147-193. [all data]
Lai and Song, 1995
Lai, W.-C.; Song, C.,
Temperature-programmed retention indices for g.c. and g.c.-m.s. analysis of coal- and petroleum-derived liquid fuels,
Fuel, 1995, 74, 10, 1436-1451, https://doi.org/10.1016/0016-2361(95)00108-H
. [all data]
Rostad and Pereira, 1986
Rostad, C.E.; Pereira, W.E.,
Kovats and Lee retention indices determined by gas chromatography/mass spectrometry for organic compounds of environmental interest,
J. Hi. Res. Chromatogr. Chromatogr. Comm., 1986, 9, 6, 328-334, https://doi.org/10.1002/jhrc.1240090603
. [all data]
Korhonen and Lind, 1985
Korhonen, I.O.O.; Lind, M.A.,
Gas-liquid chromatographic analyses. XXXIV. Separation and retention indices with retention increments of some nitrated polynuclear aromatic hydrocarbons on a low-polarity (SE-30) capillary column,
J. Chromatogr., 1985, 322, 71-81, https://doi.org/10.1016/S0021-9673(01)97660-5
. [all data]
Ardrey and Moffat, 1981
Ardrey, R.E.; Moffat, A.C.,
Gas-liquid chromatographic retention indices of 1318 substances of toxicological interest on SE-30 or OV-1 stationary phase,
J. Chromatogr., 1981, 220, 3, 195-252, https://doi.org/10.1016/S0021-9673(00)81925-1
. [all data]
Peng, Yang, et al., 1991
Peng, C.T.; Yang, Z.C.; Ding, S.F.,
Prediction of rentention idexes. II. Structure-retention index relationship on polar columns,
J. Chromatogr., 1991, 586, 1, 85-112, https://doi.org/10.1016/0021-9673(91)80028-F
. [all data]
Wang, Hou, et al., 2007
Wang, G.; Hou, Z.; Sun, Y.; Liu, Y.; Xie, B.; Liu, S.,
Investigation of pyrolysis behavior of fenoxycarb using PY-GC-MS assisted with chemometric methods,
Chem. Anal., 2007, 52, 141-156. [all data]
Marynowski, Pieta, et al., 2004
Marynowski, L.; Pieta, M.; Janeczek, J.,
Composition and source of polycyclic aromatic compounds in deposited dust from selected sites around the Upper Silesia, Poland,
Geol. Q., 2004, 48, 2, 169-180. [all data]
Piao, Chu, et al., 1999
Piao, M.; Chu, S.; Zheng, M.; Xu, X.,
Characterization of the combustion products of polyethylene,
Chemosphere, 1999, 39, 9, 1497-1512, https://doi.org/10.1016/S0045-6535(99)00054-5
. [all data]
Durlak, Biswas, et al., 1998
Durlak, S.K.; Biswas, P.; Shi, J.; Bernhard, M.J.,
Characterization of polycyclic aromatic hydrocarbon particulate and gaseous emissions from polystyrene combustion,
Environ. Sci. Technol., 1998, 32, 15, 2301-2307, https://doi.org/10.1021/es9709031
. [all data]
Lee, Vassilaros, et al., 1979
Lee, M.L.; Vassilaros, D.L.; White, C.M.; Novotny, M.,
Retention Indices for Programmed-Temperature Capillary-Column Gas Chromatography of Polycyclic Aromatic Hydrocarbons,
Anal. Chem., 1979, 51, 6, 768-773, https://doi.org/10.1021/ac50042a043
. [all data]
Wang, Li, et al., 2007
Wang, Z.; Li, K.; Lambert, P.; Yang, C.,
Identification, characterization and quantitation of pyrogenic polycylic aromatic hydrocarbons and other organic compounds in tire fire products,
J. Chromatogr. A, 2007, 1139, 1, 14-26, https://doi.org/10.1016/j.chroma.2006.10.085
. [all data]
Wang, Li, et al., 2007, 2
Wang, Z.; Li, K.; Lambert, P.; Brown, C.E.; Yang, C.; Hollebone, B.P.,
Identification and characterization of polycyclic aromatic compounds in tire fire products and differentiation of pyrogenic PAHs from petrogenic PAHs
in Proceedings of the 30th Arctic and Marine Oilspill (AMOP) Technical Seminar. Vol.1, 2007, 61-85. [all data]
Shlyakhov, 1984
Shlyakhov, A.F.,
Gas chromatography in organic geochemistry, Nedra, Moscow, 1984, 221. [all data]