Benzidine
- Formula: C12H12N2
- Molecular weight: 184.2371
- IUPAC Standard InChIKey: HFACYLZERDEVSX-UHFFFAOYSA-N
- CAS Registry Number: 92-87-5
- Chemical structure:
View 3d structure (requires JavaScript / HTML 5) - Other names: [1,1'-Biphenyl]-4,4'-diamine; p-Diaminodiphenyl; p,p'-Bianiline; p,p'-Diaminobiphenyl; C.I. Azoic Diazo Component 112; Fast Corinth Base B; 4,4'-Bianiline; 4,4'-Biphenyldiamine; 4,4'-Diaminobiphenyl; 4,4'-Diaminodiphenyl; 4,4'-Diphenylenediamine; Biphenyl -4,4'-ylenediamine; Benzidin; Benzidina; Benzydyna; Biphenyl,4,4'-diamino-; 4,4'-Biphenylenediamine; p,p-Bianiline; C.I. 37225; 4,4'-Diamino-1,1'-biphenyl; p,p'-Dianiline; NCI-C03361; Rcra waste number U021; UN 1885; NSC 146476

Condensed phase thermochemistry data

Data compiled by: Hussein Y. Afeefy, Joel F. Liebman, and Stephen E. Stein
Quantity | Value | Units | Method | Reference | Comment |
---|---|---|---|---|---|
ΔfH°solid | 107. | kJ/mol | Ccb | Lemoult, 1906 | Author value for hf298-condensed=18.5 kcal/mol |
Quantity | Value | Units | Method | Reference | Comment |
ΔcH°solid | -6508. ± 1. | kJ/mol | Ccb | Pongratz, Bohmert-Sub, et al., 1944 | |
ΔcH°solid | -6544.2 | kJ/mol | Ccb | Lemoult, 1906 | Author value for hf298-condensed=18.5 kcal/mol |

Phase change data

Data compiled as indicated in comments:
BS - Robert L. Brown and Stephen E. Stein
TRC - Thermodynamics Research Center, NIST Boulder Laboratories, Chris Muzny director
AC - William E. Acree, Jr., James S. Chickos
Quantity | Value | Units | Method | Reference | Comment |
---|---|---|---|---|---|
Tfus | 400. | K | N/A | Rai and George, 1992 | Crystal phase 1 phase; Uncertainty assigned by TRC = 1. K; TRC |
Tfus | 273.15 | K | N/A | Bastic and Pushin, 1947 | Uncertainty assigned by TRC = 2. K; TRC |
Reduced pressure boiling point
Tboil (K) | Pressure (bar) | Reference | Comment |
---|---|---|---|
673.2 | 0.987 | Weast and Grasselli, 1989 | BS |
Enthalpy of fusion
ΔfusH (kJ/mol) | Temperature (K) | Reference | Comment |
---|---|---|---|
19.1 | 400.2 | Rai and George, 1992, 2 | AC |

Reaction thermochemistry data

Data compiled by: Hussein Y. Afeefy, Joel F. Liebman, and Stephen E. Stein
Individual Reactions
By formula: C12H12N2 = C12H12N2
Quantity | Value | Units | Method | Reference | Comment |
---|---|---|---|---|---|
ΔrH° | -102.8 ± 1.0 | kJ/mol | Cm | Pongratz, Bohmert-Sub, et al., 1944 | solid phase; Reanalyzed by Cox and Pilcher, 1970, Original value = -106.4 ± 0.2 kJ/mol; Heat of transposition |
By formula: C8H4O3 + C12H12N2 = C20H16N2O3
Quantity | Value | Units | Method | Reference | Comment |
---|---|---|---|---|---|
ΔrH° | -67.4 ± 0.4 | kJ/mol | Eqk | Karyakin, Rabinovich, et al., 1978 | liquid phase; solvent: DMF |

Gas phase ion energetics data

Data compiled by: Sharon G. Lias, Rhoda D. Levin, and Sherif A. Kafafi
Ionization energy determinations
IE (eV) | Method | Reference |
---|---|---|
6.88 | PI | Pykhtina, Cherednichenko, et al., 1974 |

Normal alkane RI, non-polar column, temperature ramp

Column type | Active phase | I | Reference | Comment |
---|---|---|---|---|
Capillary | SE-54 | 2111. | Harland, Cumming, et al., 1986 | He, 50. C @ 2. min, 8. K/min, 250. C @ 12. min; Column length: 25. m; Column diameter: 0.32 mm |
Packed | SE-30 | 2070. | Marozzi, Gambaro, et al., 1982 | Gas Chrom P, 2.5 K/min; Column length: 2. m; Tstart: 120. C; Tend: 200. C |

Normal alkane RI, non-polar column, custom temperature program

Column type | Active phase | I | Reference | Comment |
---|---|---|---|---|
Capillary | OV-1 | 2042. | Waggott and Davies, 1984 | Hydrogen; Column length: 50. m; Column diameter: 0.32 mm; Program: not specified |

References

Lemoult, 1906
Lemoult, M.P.,
Thermochimie. - Chaleur de combustion et de formation de quelques composes cycliques azotes,
Compt. Rend., 1906, 143, 772-775. [all data]
Pongratz, Bohmert-Sub, et al., 1944
Pongratz, A.; Bohmert-Sub, S.; Scholtis, K.,
Zur thermochemie der benzidin-umlagerung,
Ber., 1944, 77, 651-735. [all data]
Rai and George, 1992
Rai, U.S.; George, S.,
A physicochemical study on organic eutectics and addition compound; benzidine-pyrogallol system,
Can. J. Chem., 1992, 70, 2869-74. [all data]
Bastic and Pushin, 1947
Bastic, B.L.; Pushin, N.A.,
Melting diagrams of mixtures of formic acid,
Glas. Hem. Drus. Beograd, 1947, 128, 109. [all data]
Weast and Grasselli, 1989
CRC Handbook of Data on Organic Compounds, 2nd Editon, Weast,R.C and Grasselli, J.G., ed(s)., CRC Press, Inc., Boca Raton, FL, 1989, 1. [all data]
Rai and George, 1992, 2
Rai, U.S.; George, Santhi,
A physicochemical study on organic eutectics and addition compound; benzidine--pyrogallol system,
Can. J. Chem., 1992, 70, 12, 2869-2874, https://doi.org/10.1139/v92-366
. [all data]
Cox and Pilcher, 1970
Cox, J.D.; Pilcher, G.,
Thermochemistry of Organic and Organometallic Compounds, Academic Press, New York, 1970, 1-636. [all data]
Karyakin, Rabinovich, et al., 1978
Karyakin, N.V.; Rabinovich, I.B.; Pal'tseva, N.G.,
Thermodynamics of the reactions of aromatic diamines with dianhydrides of tetracarboxylic acids,
Polym. Sci. USSR, 1978, 20, 2274-2279. [all data]
Pykhtina, Cherednichenko, et al., 1974
Pykhtina, E.V.; Cherednichenko, L.V.; Kardash, I.E.; Evlasheva, T.I.; Sorokin, V.V.; Potapov, V.K.; Pravednikov, A.N.,
Ionization potentials of amines and energies of charge transfer bands in the absorption spectra of complexes of 7,7,8,8-tetracyanoquinodimethan,
High Energy Chem., 1974, 8, 257, In original 307. [all data]
Harland, Cumming, et al., 1986
Harland, B.J.; Cumming, R.I.; Gillings, E.,
The Kovats indexes of some organic micropollutants on an SE54 capillary column,
EUR, I Org. Micropollut. Aquat. Environ., 1986, EUR 10388, 123-127. [all data]
Marozzi, Gambaro, et al., 1982
Marozzi, E.; Gambaro, V.; Saligari, E.; Mariani, R.; Lodi, F.,
Use of the retention index in gas chromatographic studies of drugs,
J. Anal. Toxicol., 1982, 6, 4, 185-192, https://doi.org/10.1093/jat/6.4.185
. [all data]
Waggott and Davies, 1984
Waggott, A.; Davies, I.W.,
Identification of organic pollutants using linear temperature programmed retention indices (LTPRIs) - Part II, 1984, retrieved from http://dwi.defra.gov.uk/research/completed-research/reports/dwi0383.pdf. [all data]