Nitric acid, butyl ester
- Formula: C4H9NO3
- Molecular weight: 119.1192
- IUPAC Standard InChIKey: QQHZPQUHCAKSOL-UHFFFAOYSA-N
- CAS Registry Number: 928-45-0
- Chemical structure:
View 3d structure (requires JavaScript / HTML 5) - Other names: Butyl nitrate; n-C4H9ONO2

Phase change data

Data compiled as indicated in comments:
BS - Robert L. Brown and Stephen E. Stein
ALS - Hussein Y. Afeefy, Joel F. Liebman, and Stephen E. Stein
AC - William E. Acree, Jr., James S. Chickos
Quantity | Value | Units | Method | Reference | Comment |
---|---|---|---|---|---|
Tboil | 409.2 | K | N/A | Weast and Grasselli, 1989 | BS |
Quantity | Value | Units | Method | Reference | Comment |
ΔvapH° | 43.597 | kJ/mol | V | Gray and Pratt, 1957 | ALS |
Enthalpy of vaporization
ΔvapH (kJ/mol) | Temperature (K) | Method | Reference | Comment |
---|---|---|---|---|
44.1 | 288. | A | Stephenson and Malanowski, 1987 | Based on data from 273. to 343. K. See also Dykyj, 1971 and Gray and Pratt, 1957, 2.; AC |
Antoine Equation Parameters
log10(P) = A − (B / (T + C))
P = vapor pressure (bar)
T = temperature (K)
View plot Requires a JavaScript / HTML 5 canvas capable browser.
Temperature (K) | A | B | C | Reference | Comment |
---|---|---|---|---|---|
273. to 343. | 5.46933 | 2177.065 | -4.855 | Gray and Pratt, 1957, 3 | Coefficents calculated by NIST from author's data. |

Gas phase ion energetics data

Data compiled by: Henry M. Rosenstock, Keith Draxl, Bruce W. Steiner, and John T. Herron
Appearance energy determinations
Ion | AE (eV) | Other Products | Method | Reference | Comment |
---|---|---|---|---|---|
C3H7+ | 11.5 | ? | EI | Fraser and Paul, 1968 |

Normal alkane RI, non-polar column, temperature ramp

Column type | Active phase | I | Reference | Comment |
---|---|---|---|---|
Capillary | DB-1 | 801. | Schneider and Ballschniter, 1996 | 40. C @ 3. min, 3. K/min; Tend: 250. C |

References

Weast and Grasselli, 1989
CRC Handbook of Data on Organic Compounds, 2nd Editon, Weast,R.C and Grasselli, J.G., ed(s)., CRC Press, Inc., Boca Raton, FL, 1989, 1. [all data]
Gray and Pratt, 1957
Gray, P.; Pratt, M.W.T.,
The latent heats of vaporization of the alkyl nitrates,
J. Chem. Soc., 1957, 2163-21. [all data]
Stephenson and Malanowski, 1987
Stephenson, Richard M.; Malanowski, Stanislaw,
Handbook of the Thermodynamics of Organic Compounds, 1987, https://doi.org/10.1007/978-94-009-3173-2
. [all data]
Dykyj, 1971
Dykyj, J.,
Petrochemia, 1971, 11, 2, 27. [all data]
Gray and Pratt, 1957, 2
Gray, Peter; Pratt, M.W.T.,
414. The latent heats of vaporization of the alkyl nitrates,
J. Chem. Soc., 1957, 2163, https://doi.org/10.1039/jr9570002163
. [all data]
Gray and Pratt, 1957, 3
Gray, P.; Pratt, M.W.T.,
The Latent Heats of Vaporization of the Alkyl Nitrates,
J. Chem. Soc., 1957, 2163-2168, https://doi.org/10.1039/jr9570002163
. [all data]
Fraser and Paul, 1968
Fraser, R.T.M.; Paul, N.C.,
The mass spectrometry of nitrate esters and related compounds. Part I,
J. Chem. Soc. B, 1968, 659. [all data]
Schneider and Ballschniter, 1996
Schneider, M.; Ballschniter, K.,
Separation of Diastereomeric and Enentiomeric Alkyl Nitrates - Systematic Approach to Chiral Discrimination on Cyclodextrin LIPODEX-D,
Chem. Eur. J., 1996, 2, 5, 539-544, https://doi.org/10.1002/chem.19960020513
. [all data]