9H-Xanthene
- Formula: C13H10O
- Molecular weight: 182.2179
- IUPAC Standard InChIKey: GJCOSYZMQJWQCA-UHFFFAOYSA-N
- CAS Registry Number: 92-83-1
- Chemical structure:
View 3d structure (requires JavaScript / HTML 5) - Other names: Xanthene; 10H-9-Oxaanthracene; Dibenzo[a,e]pyran; Dibenzopyran, tricyclic; NSC 46931; 9-H-Xathene

Phase change data

Data compiled as indicated in comments:
BS - Robert L. Brown and Stephen E. Stein
TRC - Thermodynamics Research Center, NIST Boulder Laboratories, Chris Muzny director
AC - William E. Acree, Jr., James S. Chickos
Quantity | Value | Units | Method | Reference | Comment |
---|---|---|---|---|---|
Tboil | 584.2 | K | N/A | Weast and Grasselli, 1989 | BS |
Quantity | Value | Units | Method | Reference | Comment |
Tfus | 373.7 | K | N/A | Coon, Sediawan, et al., 1988 | Uncertainty assigned by TRC = 0.1 K; TRC |
Enthalpy of vaporization
ΔvapH (kJ/mol) | Temperature (K) | Method | Reference | Comment |
---|---|---|---|---|
88.7 | 423. | A | Stephenson and Malanowski, 1987 | Based on data from 413. to 433. K. See also Cass, Fletcher, et al., 1958.; AC |
64.5 | 435. | N/A | Sivaraman and Kobayashi, 1984 | Based on data from 424. to 589. K.; AC |
61.1 | 475. | N/A | Sivaraman and Kobayashi, 1984 | Based on data from 424. to 589. K.; AC |
59.2 | 515. | N/A | Sivaraman and Kobayashi, 1984 | Based on data from 424. to 589. K.; AC |
56.7 | 555. | N/A | Sivaraman and Kobayashi, 1984 | Based on data from 424. to 589. K.; AC |
54.4 | 585. | N/A | Sivaraman and Kobayashi, 1984 | Based on data from 424. to 589. K.; AC |
Enthalpy of sublimation
ΔsubH (kJ/mol) | Temperature (K) | Method | Reference | Comment |
---|---|---|---|---|
92.5 | 329. | T | Rordorf, 1986 | Based on data from 305. to 353. K.; AC |
Enthalpy of fusion
ΔfusH (kJ/mol) | Temperature (K) | Method | Reference | Comment |
---|---|---|---|---|
20.67 | 374.6 | DSC | Monte, Santos, et al., 2008 | AC |
15.87 | 374.3 | DSC | Mahmoud, Solimando, et al., 2000 | AC |
19.2 | 373.7 | N/A | Acree, 1991 | AC |

Gas phase ion energetics data

Data compiled by: Sharon G. Lias, Rhoda D. Levin, and Sherif A. Kafafi
Ionization energy determinations
IE (eV) | Method | Reference |
---|---|---|
7.65 ± 0.02 | PE | Bouchoux and Dagaut, 1981 |
Appearance energy determinations
Ion | AE (eV) | Other Products | Method | Reference | Comment |
---|---|---|---|---|---|
C13H9O+ | 11.2 ± 0.1 | H | PE | Bouchoux and Dagaut, 1981 |

Kovats' RI, non-polar column, isothermal

Column type | Active phase | Temperature (C) | I | Reference | Comment |
---|---|---|---|---|---|
Capillary | OV-1 | 150. | 1620. | Zhang, Chen, et al., 1997 | 25. m/0.2 mm/0.33 μm, N2 |
Capillary | OV-1 | 160. | 1628. | Zhang, Chen, et al., 1997 | 25. m/0.2 mm/0.33 μm, N2 |

Van Den Dool and Kratz RI, non-polar column, temperature ramp

Column type | Active phase | I | Reference | Comment |
---|---|---|---|---|
Capillary | OV-1 | 1645.8 | Zhang, Shen, et al., 2000 | 25. m/0.2 mm/0.33 μm, 5. K/min; Tstart: 100. C; Tend: 180. C |
Capillary | OV-1 | 1659.8 | Zhang, Shen, et al., 2000 | 25. m/0.2 mm/0.33 μm, 5. K/min; Tstart: 100. C; Tend: 180. C |
Capillary | DB-5 | 1661. | Rostad and Pereira, 1986 | 30. m/0.26 mm/0.25 μm, He, 50. C @ 4. min, 6. K/min, 300. C @ 20. min |

Normal alkane RI, non-polar column, temperature ramp

Column type | Active phase | I | Reference | Comment |
---|---|---|---|---|
Capillary | Ultra-1 | 1599. | Okumura, 1991 | 25. m/0.32 mm/0.25 μm, He, 3. K/min; Tstart: 80. C; Tend: 260. C |

Normal alkane RI, non-polar column, custom temperature program

Column type | Active phase | I | Reference | Comment |
---|---|---|---|---|
Capillary | Methyl Silicone | 1627. | Oda, Yasuhara, et al., 1998 | 25. m/0.25 mm/0.25 μm, He; Program: 50 0C (2 min) 20 0C/min -> 160 0C 5 0C/min -> 210 0C 10 0C/min -> 300 0C |
Capillary | Methyl Silicone | 1635. | Zenkevich, 1994 | Program: not specified |

Lee's RI, non-polar column, temperature ramp

Column type | Active phase | I | Reference | Comment |
---|---|---|---|---|
Capillary | HP-5 | 281.8 | Shao, Wang, et al., 2006 | 30. m/0.3 mm/0.25 μm, He, 50. C @ 5. min, 5. K/min, 200. C @ 15. min |
Capillary | DB-5 | 279.1 | Durlak, Biswas, et al., 1998 | 30. m/0.25 mm/0.25 μm, 15. K/min; Tstart: 50. C; Tend: 300. C |
Capillary | DB-5 | 281.04 | Rostad and Pereira, 1986 | 30. m/0.26 mm/0.25 μm, He, 50. C @ 4. min, 6. K/min, 300. C @ 20. min |
Capillary | SE-52 | 280.48 | Lee, Vassilaros, et al., 1979 | 12. m/0.3 mm/0.34 μm, He, 2. K/min; Tstart: 50. C; Tend: 250. C |

References

Weast and Grasselli, 1989
CRC Handbook of Data on Organic Compounds, 2nd Editon, Weast,R.C and Grasselli, J.G., ed(s)., CRC Press, Inc., Boca Raton, FL, 1989, 1. [all data]
Coon, Sediawan, et al., 1988
Coon, J.E.; Sediawan, W.B.; Auwaerter, J.E.; McLaughlin, E.,
Solubilities of families of heterocyclic polynuclear aromatics in organic solvents and their mixtures,
J. Solution Chem., 1988, 17, 519. [all data]
Stephenson and Malanowski, 1987
Stephenson, Richard M.; Malanowski, Stanislaw,
Handbook of the Thermodynamics of Organic Compounds, 1987, https://doi.org/10.1007/978-94-009-3173-2
. [all data]
Cass, Fletcher, et al., 1958
Cass, R.C.; Fletcher, S.E.; Mortimer, C.T.; Springall, H.D.; White, T.R.,
281. Heats of combustion and molecular structure. Part V. The mean bond energy term for the C?O bond in ethers, and the structures of some cyclic ethers,
J. Chem. Soc., 1958, 1406, https://doi.org/10.1039/jr9580001406
. [all data]
Sivaraman and Kobayashi, 1984
Sivaraman, Alwarappa; Kobayashi, Riki,
Investigation of vapor pressures and enthalpies and entropies of vaporization of xanthene at elevated temperatures,
J. Chem. Eng. Data, 1984, 29, 4, 375-379, https://doi.org/10.1021/je00038a003
. [all data]
Rordorf, 1986
Rordorf, Berchtold F.,
Thermal properties of dioxins, furans and related compounds,
Chemosphere, 1986, 15, 9-12, 1325-1332, https://doi.org/10.1016/0045-6535(86)90407-8
. [all data]
Monte, Santos, et al., 2008
Monte, Manuel J.S.; Santos, Luis M.N.B.F.; Sousa, Carlos A.D.; Fulem, Michal,
Vapor Pressures of Solid and Liquid Xanthene and Phenoxathiin from Effusion and Static Studies,
J. Chem. Eng. Data, 2008, 53, 8, 1922-1926, https://doi.org/10.1021/je800333q
. [all data]
Mahmoud, Solimando, et al., 2000
Mahmoud, R.; Solimando, R.; Bouroukba, M.; Rogalski, M.,
Solid-Liquid Equilibrium and Excess Enthalpy Measurements in Binary {Dibenzofuran or Xanthene + Normal Long-Chain Alkane} Systems,
J. Chem. Eng. Data, 2000, 45, 3, 433-436, https://doi.org/10.1021/je9902084
. [all data]
Acree, 1991
Acree, William E.,
Thermodynamic properties of organic compounds: enthalpy of fusion and melting point temperature compilation,
Thermochimica Acta, 1991, 189, 1, 37-56, https://doi.org/10.1016/0040-6031(91)87098-H
. [all data]
Bouchoux and Dagaut, 1981
Bouchoux, G.; Dagaut, J.,
Mechanisms of formation of [M-HCO]+ and [M-C6H5CO]+ ions from isomers of 1,4-benzodioxin derivatives,
Org. Mass Spectrom., 1981, 16, 246. [all data]
Davies, Kirkaldy, et al., 1960
Davies, J.E.; Kirkaldy, D.; Roberts, J.C.,
Studies in mycological chemistry. Part VII. Sterigmatocystin, a metabolite of aspergillus versicolor (vuillemin) tiraboschi,
J. Chem. Soc., 1960, 2169-2178. [all data]
Zhang, Chen, et al., 1997
Zhang, M.; Chen, B.; Shen, S.; Chen, S.,
Compositional studies of high-temperature coal tar by g.c.-FT-i.r. analysis of middle oil fractions,
Fuel, 1997, 76, 5, 415-423, https://doi.org/10.1016/S0016-2361(97)85518-4
. [all data]
Zhang, Shen, et al., 2000
Zhang, M.-J.; Shen, S.-D.; Chen, S.-Y.; Sun, Y.-H.,
Analysis of heavy oil fractions in high-temperature coal tar by capillary gas chromatography/fourier transform infrared spectrometry,
Chin. J. Chromatogr., 2000, 18, 3, 241-246. [all data]
Rostad and Pereira, 1986
Rostad, C.E.; Pereira, W.E.,
Kovats and Lee retention indices determined by gas chromatography/mass spectrometry for organic compounds of environmental interest,
J. Hi. Res. Chromatogr. Chromatogr. Comm., 1986, 9, 6, 328-334, https://doi.org/10.1002/jhrc.1240090603
. [all data]
Okumura, 1991
Okumura, T.,
retention indices of environmental chemicals on methyl silicone capillary column,
Journal of Environmental Chemistry (Japan), 1991, 1, 2, 333-358, https://doi.org/10.5985/jec.1.333
. [all data]
Oda, Yasuhara, et al., 1998
Oda, J.; Yasuhara, A.; Matsunaga, K.; Saito, Y.,
Identification of polycyclic aromatic hydrocarbons of the particulate accumulated in the tunnel duct of freeway and generation of their oxygenated derivatives,
Jpn. J. Toxicol. Environ. Health, 1998, 44, 5, 334-351, https://doi.org/10.1248/jhs1956.44.334
. [all data]
Zenkevich, 1994
Zenkevich, I.G.,
Contemporary State of Informational Maintenance for Gas Chromatographic Identification of Chlorinated Polycyclic Aromatic Compounds,
Zh. Ecol. Khim., 1994, 3, 2, 111-119. [all data]
Shao, Wang, et al., 2006
Shao, X.; Wang, G.; Sun, Y.; Zhang, R.; Xie, K.; Liu, H.,
Determination and Characterization of the Pyrolysis Products of Isoprocarb by GC-MS,
J. Chromatogr. Sci., 2006, 44, 3, 141-147, https://doi.org/10.1093/chromsci/44.3.141
. [all data]
Durlak, Biswas, et al., 1998
Durlak, S.K.; Biswas, P.; Shi, J.; Bernhard, M.J.,
Characterization of polycyclic aromatic hydrocarbon particulate and gaseous emissions from polystyrene combustion,
Environ. Sci. Technol., 1998, 32, 15, 2301-2307, https://doi.org/10.1021/es9709031
. [all data]
Lee, Vassilaros, et al., 1979
Lee, M.L.; Vassilaros, D.L.; White, C.M.; Novotny, M.,
Retention Indices for Programmed-Temperature Capillary-Column Gas Chromatography of Polycyclic Aromatic Hydrocarbons,
Anal. Chem., 1979, 51, 6, 768-773, https://doi.org/10.1021/ac50042a043
. [all data]