Phenazine
- Formula: C12H8N2
- Molecular weight: 180.2053
- IUPAC Standard InChIKey: PCNDJXKNXGMECE-UHFFFAOYSA-N
- CAS Registry Number: 92-82-0
- Chemical structure:
View 3d structure (requires JavaScript / HTML 5) - Other names: Azophenylene; Dibenzo-p-diazine; Dibenzopyrazine; 9,10-Diazaanthracene; Dibenzoparadiazine

Gas phase thermochemistry data

Data compiled by: Hussein Y. Afeefy, Joel F. Liebman, and Stephen E. Stein
Quantity | Value | Units | Method | Reference | Comment |
---|---|---|---|---|---|
ΔfH°gas | 338.3 ± 3.4 | kJ/mol | Ccr | Sabbah and El Watik, 1991 | |
ΔfH°gas | 328.8 ± 2.9 | kJ/mol | Ccb | Leitao, Pilcher, et al., 1990 | |
ΔfH°gas | 343.6 ± 2.8 | kJ/mol | Ccb | Arshadi, 1980 |

Condensed phase thermochemistry data

Data compiled as indicated in comments:
ALS - Hussein Y. Afeefy, Joel F. Liebman, and Stephen E. Stein
DH - Eugene S. Domalski and Elizabeth D. Hearing
Quantity | Value | Units | Method | Reference | Comment |
---|---|---|---|---|---|
ΔfH°solid | 241.3 ± 3.4 | kJ/mol | Ccr | Sabbah and El Watik, 1991 | ALS |
ΔfH°solid | 237.0 ± 2.0 | kJ/mol | Ccb | Leitao, Pilcher, et al., 1990 | ALS |
ΔfH°solid | 243.7 ± 2.3 | kJ/mol | Ccb | Arshadi, 1980 | ALS |
Quantity | Value | Units | Method | Reference | Comment |
ΔcH°solid | -6106.7 ± 3.3 | kJ/mol | Ccr | Sabbah and El Watik, 1991 | ALS |
ΔcH°solid | -6102.4 ± 1.2 | kJ/mol | Ccb | Leitao, Pilcher, et al., 1990 | ALS |
ΔcH°solid | -6109.1 ± 1.7 | kJ/mol | Ccb | Arshadi, 1980 | ALS |
ΔcH°solid | -6112.8 ± 6.3 | kJ/mol | Ccb | Willis, 1947 | Reanalyzed by Cox and Pilcher, 1970, Original value = -6112.4 ± 5.9 kJ/mol; ALS |
Constant pressure heat capacity of solid
Cp,solid (J/mol*K) | Temperature (K) | Reference | Comment |
---|---|---|---|
234.3 | 298.15 | Sabbah and El Watik, 1991 | DH |

Phase change data

Data compiled as indicated in comments:
TRC - Thermodynamics Research Center, NIST Boulder Laboratories, Chris Muzny director
AC - William E. Acree, Jr., James S. Chickos
ALS - Hussein Y. Afeefy, Joel F. Liebman, and Stephen E. Stein
DRB - Donald R. Burgess, Jr.
DH - Eugene S. Domalski and Elizabeth D. Hearing
Quantity | Value | Units | Method | Reference | Comment |
---|---|---|---|---|---|
Tfus | 444. | K | N/A | McEachern, Sandoval, et al., 1975 | Uncertainty assigned by TRC = 2. K; TRC |
Tfus | 451. | K | N/A | Sangster and Irvine, 1956 | Uncertainty assigned by TRC = 3. K; TRC |
Quantity | Value | Units | Method | Reference | Comment |
ΔsubH° | 95. ± 7. | kJ/mol | AVG | N/A | Average of 11 values; Individual data points |
Enthalpy of vaporization
ΔvapH (kJ/mol) | Temperature (K) | Reference | Comment |
---|---|---|---|
66.1 ± 0.1 | 450. | Chirico, Kazakov, et al., 2010 | AC |
65.5 ± 0.1 | 460. | Chirico, Kazakov, et al., 2010 | AC |
65.0 ± 0.1 | 470. | Chirico, Kazakov, et al., 2010 | AC |
Enthalpy of sublimation
ΔsubH (kJ/mol) | Temperature (K) | Method | Reference | Comment |
---|---|---|---|---|
96.970 | 298.15 | N/A | Sabbah and El Watik, 1992 | DH |
94.3 ± 0.4 | 354. | N/A | Chirico, Kazakov, et al., 2010 | AC |
92.7 ± 0.4 | 354. | N/A | Sabbah and El Watik, 1991 | AC |
92.4 | 295. | N/A | Stephenson and Malanowski, 1987 | Based on data from 280. to 318. K.; AC |
90. ± 2. | 281.2 | V | McEachern, Sandoval, et al., 1975, 2 | hfusion=5.00±0.17 kcal/mol; ALS |
90.4 ± 1.7 | 281. to 293. | LE | McEachern, Sandoval, et al., 1975, 2 | AC |
Enthalpy of fusion
ΔfusH (kJ/mol) | Temperature (K) | Method | Reference | Comment |
---|---|---|---|---|
18.880 | 447.89 | N/A | Sabbah and El Watik, 1992 | DH |
18.880 | 447.89 | N/A | Sabbah and El Watik, 1991 | DH |
24.92 | 447.9 | AC | Chirico, Kazakov, et al., 2010 | AC |
20.92 | 450.2 | DSC | McEachern, Sandoval, et al., 1975, 2 | AC |

Gas phase ion energetics data

Data evaluated as indicated in comments:
HL - Edward P. Hunter and Sharon G. Lias
Data compiled as indicated in comments:
LLK - Sharon G. Lias, Rhoda D. Levin, and Sherif A. Kafafi
B - John E. Bartmess
Quantity | Value | Units | Method | Reference | Comment |
---|---|---|---|---|---|
Proton affinity (review) | 938.4 | kJ/mol | N/A | Hunter and Lias, 1998 | HL |
Quantity | Value | Units | Method | Reference | Comment |
Gas basicity | 908.3 | kJ/mol | N/A | Hunter and Lias, 1998 | HL |
Electron affinity determinations
EA (eV) | Method | Reference | Comment |
---|---|---|---|
1.31 ± 0.10 | IMRE | Dillow and Kebarle, 1989 | ΔGea(423 K) = -29.5 kcal/mol; ΔSea =-1.5, taken as that of anthracene, from Kebarle and Chowdhury, 1987. 9,10-diazaanthracene; B |
Ionization energy determinations
IE (eV) | Method | Reference | Comment |
---|---|---|---|
8.33 | PE | Hush, Cheung, et al., 1975 | LLK |
8.44 ± 0.02 | PE | Maier, Muller, et al., 1975 | Vertical value; LLK |
8.33 ± 0.02 | PE | Hush, Cheung, et al., 1975 | Vertical value; LLK |

Kovats' RI, non-polar column, custom temperature program

Column type | Active phase | I | Reference | Comment |
---|---|---|---|---|
Packed | SE-30 | 1703. | Ramsey, Lee, et al., 1980 | He, Chromosorb G HP (80-100 mesh); Column length: 1.5 m; Program: not specified |

Normal alkane RI, non-polar column, temperature ramp

Column type | Active phase | I | Reference | Comment |
---|---|---|---|---|
Capillary | Ultra-1 | 1670. | Okumura, 1991 | 25. m/0.32 mm/0.25 μm, He, 3. K/min; Tstart: 80. C; Tend: 260. C |

Normal alkane RI, non-polar column, custom temperature program

Column type | Active phase | I | Reference | Comment |
---|---|---|---|---|
Capillary | Ultra-1 | 1666. | Tameo and Kiyos, 1991 | Program: not specified |
Capillary | OV-1, SE-30, Methyl silicone, SP-2100, OV-101, DB-1, etc. | 1703. | Waggott and Davies, 1984 | Hydrogen; Column length: 50. m; Column diameter: 0.32 mm; Program: not specified |
Other | Methyl Silicone | 1703. | Ardrey and Moffat, 1981 | Program: not specified |

Normal alkane RI, polar column, custom temperature program

Column type | Active phase | I | Reference | Comment |
---|---|---|---|---|
Capillary | Carbowax 20M | 2557. | Tameo and Kiyos, 1991 | Program: not specified |

Lee's RI, non-polar column, temperature ramp

Column type | Active phase | I | Reference | Comment |
---|---|---|---|---|
Capillary | SE-52 | 294.37 | Vassilaros, Kong, et al., 1982 | 20. m/0.30 mm/0.25 μm, H2, 40. C @ 2. min, 4. K/min; Tend: 265. C |

References

Sabbah and El Watik, 1991
Sabbah, R.; El Watik, L.,
Etude thermodynamique de la molecule de phenazine,
Thermochim. Acta, 1991, 176, 163-171. [all data]
Leitao, Pilcher, et al., 1990
Leitao, M.L.; Pilcher, G.; Acree, W.E., Jr.; Zvaigzne, A.I.; Tucker, S.A.; Ribeiro Da Silva, M.D.M.C.,
Enthalpies of combustion of phenazine N-oxide, phenazine, benzofuroxan, and benzofurazan: the dissociation entrhalpies of the (N-O) bonds,
J. Chem. Thermodyn., 1990, 22, 923-928. [all data]
Arshadi, 1980
Arshadi, M.R.,
Enthalpies of combustion and formation of phenazine and 2,1,3-benzoxadiazole,
J. Chem. Thermodyn., 1980, 12, 903-906. [all data]
Willis, 1947
Willis, J.B.,
The heats of combustion of some organic bases and their salts. The resonance energies of acridine and phenazine,
Trans. Faraday Soc., 1947, 43, 97-102. [all data]
Cox and Pilcher, 1970
Cox, J.D.; Pilcher, G.,
Thermochemistry of Organic and Organometallic Compounds, Academic Press, New York, 1970, 1-636. [all data]
McEachern, Sandoval, et al., 1975
McEachern, D.M.; Sandoval, O.; Iniguez, J.C.,
Vapor pressures, derived enthalpies of sublimation, enthalpies of fusion, and resonance energies of acridine and phenazine,
J. Chem. Thermodyn., 1975, 7, 299. [all data]
Sangster and Irvine, 1956
Sangster, R.C.; Irvine, J.W.,
Study of Organic Scintillators,
J. Chem. Phys., 1956, 24, 670. [all data]
Chirico, Kazakov, et al., 2010
Chirico, Robert D.; Kazakov, Andrei F.; Steele, William V.,
Thermodynamic properties of three-ring aza-aromatics. 1. Experimental results for phenazine and acridine, and mutual validation of experiments and computational methods,
The Journal of Chemical Thermodynamics, 2010, 42, 5, 571-580, https://doi.org/10.1016/j.jct.2009.11.010
. [all data]
Sabbah and El Watik, 1992
Sabbah, R.; El Watik, L.,
Thermodynamic study of anthrone, counmarin and phenazine,
J. Therm. Anal., 1992, 38, 803-809. [all data]
Stephenson and Malanowski, 1987
Stephenson, Richard M.; Malanowski, Stanislaw,
Handbook of the Thermodynamics of Organic Compounds, 1987, https://doi.org/10.1007/978-94-009-3173-2
. [all data]
McEachern, Sandoval, et al., 1975, 2
McEachern, D.M.; Sandoval, O.; Iniguez, J.C.,
Vapor pressures, derived enthalpies of sublimation, enthalpies of fusion, and resonance energies of acridine and phenazine,
J. Chem. Thermodyn., 1975, 7, 299-306. [all data]
Hunter and Lias, 1998
Hunter, E.P.; Lias, S.G.,
Evaluated Gas Phase Basicities and Proton Affinities of Molecules: An Update,
J. Phys. Chem. Ref. Data, 1998, 27, 3, 413-656, https://doi.org/10.1063/1.556018
. [all data]
Dillow and Kebarle, 1989
Dillow, G.W.; Kebarle, P.,
Electron Affinities of aza-substituted polycyclic aromatic hydrocarbons,
Can. J. Chem., 1989, 67, 10, 1628, https://doi.org/10.1139/v89-249
. [all data]
Kebarle and Chowdhury, 1987
Kebarle, P.; Chowdhury, S.,
Electron affinities and electron transfer reactions,
Chem. Rev., 1987, 87, 513. [all data]
Hush, Cheung, et al., 1975
Hush, N.S.; Cheung, A.S.; Hilton, P.R.,
Binding energies of π- and "lone pair"-levels in mono- and diaza-phenanthrenes and anthracenes: an He(I) photoelectron spectroscopic study,
J. Electron Spectrosc. Relat. Phenom., 1975, 7, 385. [all data]
Maier, Muller, et al., 1975
Maier, J.P.; Muller, J.-F.; Kubota, T.; Yamakawa, M.,
183. Ionisation energies and the electronic structures of the N-oxides of azanaphthalenes and azaanthracenes,
Helv. Chim. Acta, 1975, 58, 1641. [all data]